Peptide,PTM,ModifiedAA,ModifiedPosition,PeptideUniqueToGene,ExperimentDesc,ExpID,PubmedID,ScoreType,IdentScore,LocProb,Log2FChange,PQ-val,QuantSig,PEP,MassErrorPPM
ANHSPVASVAASSHSPVEK,ph,S,472,true,"atm and atr DNA damage response",88,25561503,"MASCOT Score",66.0000000,1.0000000,,,,,0.0000000
ANHSPVASVAASSHSPVEK,ph,S,472,true,"Tissue atlas Arabidopsis - ProteomicsDB",114,32188942,"MaxQuant score",191.5900000,0.9998880,,,,0,
ANHSPVASVAASSHSPVEK,ph,S,481,true,"Tissue atlas Arabidopsis - ProteomicsDB",114,32188942,"MaxQuant score",134.2800000,0.7575180,,,,8.7725000061465E-16,
ANHSPVASVAASSHSPVEK,ph,S,483,true,"atm and atr DNA damage response",88,25561503,"MASCOT Score",60.0000000,1.0000000,,,,,-1.0600000
ANHSPVASVAASSHSPVEK,ph,S,483,true,"TOR Kinase and ABA Receptor",100,29290610,XCorr,4.1262908,0.9146000,,,,4.3700001697289E-5,
ANHSPVASVAASSHSPVEK,ph,S,483,true,"Tissue atlas Arabidopsis - ProteomicsDB",114,32188942,"MaxQuant score",223.8200000,0.9996070,,,,0,
SGGGAQLMPSR,ph,S,514,true,"atm and atr DNA damage response",88,25561503,"MASCOT Score",56.0000000,1.0000000,,,,,0.4200000
SGGGAQLMPSR,ph,S,514,true,"Tissue atlas Arabidopsis - ProteomicsDB",114,32188942,"MaxQuant score",105.1900000,1.0000000,,,,1.4580499737349E-5,
SGGGAQLMPSRSR,ph,S,523,true,"TOR Kinase and ABA Receptor",100,29290610,XCorr,3.0438445,0.8892000,,,,0.0046780002303421,
SGGGAQLMPSRSR,ph,S,525,true,"atm and atr DNA damage response",88,25561503,"MASCOT Score",25.0000000,0.9950000,,,,,-0.2200000
SSEVSSGSSQSPPAK,ph,S,553,true,"Phytohormone-responsive phosphoproteins",34,20374526,"MASCOT Score",75.0000000,,,,,,2.8361700
SSEVSSGSSQSPPAK,ph,S,553,true,"atm and atr DNA damage response",88,25561503,"MASCOT Score",48.0000000,1.0000000,,,,,-0.8100000
SSEVSSGSSQSPPAK,ph,S,553,true,"Tissue atlas Arabidopsis - ProteomicsDB",114,32188942,"MaxQuant score",205.6600000,0.9994730,,,,4.2038953929745E-45,
