Peptide,PTM,ModifiedAA,ModifiedPosition,PeptideUniqueToGene,ExperimentDesc,ExpID,PubmedID,ScoreType,IdentScore,LocProb,Log2FChange,PQ-val,QuantSig,PEP,MassErrorPPM
SALPNYSASDADFEDQVLVEGKAKSR,nt,S,27,true,"Arg/N-end rule pathway Roots",80,25728785,"MASCOT Score",56.1600000,,,,,3.6289999115979E-5,
SALPNYSASDADFEDQVLVEGKAKSR,nt,S,27,true,"HUNTER N-terminome: legumain, GluC and trypsin",119,31951383,"MaxQuant score",114.8300000,,,,,,
SALPNYSASDADFEDQVLVEGKAKSR,nt,S,27,true,"Mitochondrial intermediate peptidases - icp55 / WT",131a,25732537,,103.9100000,,-1.7048531,,,,
SALPNYSASDADFEDQVLVEGKAKSR,nt,S,27,true,"Mitochondrial intermediate peptidases - oct1-1 / WT",131b,25732537,,100.9100000,,-1.6910555,,,,
SALPNYSASDADFEDQVLVEGKAKSR,nt,S,27,true,"Mitochondrial intermediate peptidases - oct1-2 / WT",131c,25732537,,111.9000000,,-1.8335484,,,,
SALPNYSASDADFE,nt,S,27,true,"Arg/N-end rule seed, prt6 vs. Wt",99,29168982,"MASCOT Score",34.4700000,,-0.5652843,0.0772172,NO,0.0020439999643713,4.8838477
SALPNYSASDADFE,nt,S,27,true,"HUNTER N-terminome: legumain, GluC and trypsin",119,31951383,"MaxQuant score",134.3000000,,,,,,
SALPNYSASDADFEDQVLVEGKAKSR,nta,S,27,true,"FtsH12 N-terminome: WT / FtsH12 knockdown miRNA",118,33216923,"MaxQuant score",90.7930000,,,,,0.0017307000234723,
ALPNYSASDADFEDQVLVEGKAKSR,nt,A,28,true,"Arabidopsis translation initiation landscape - NT",167b,35069635,,,,,,,,
ALPNYSASDADFE,nt,A,28,true,"Arg/N-end rule seed, prt6 vs. Wt",99,29168982,"MASCOT Score",71.2600000,,-0.0438337,0.9122839,NO,5.0929997996718E-6,-5.4683953
TFCSGADVLSLYHSINEGNTEESK,ox,C,99,true,"Redox kickstart of mitochondria",112,31871212,,,,-0.3843259,0.0153408,YES,,
FQTLDQCLTHEYR,ox,C,331,true,"Redox kickstart of mitochondria",112,31871212,,,,-1.1207906,0.0001767,YES,,
FQTLDQCLTHEYR,so,C,331,true,"Arabidopsis S-sulfenylation chemoproteomics",108,31578252,"pFind PSM Score",0.0008144,,1.9230800,,,,-0.9286171
ISICGVSK,ox,C,341,true,"Redox kickstart of mitochondria",112,31871212,,,,-0.8225225,0.0042718,YES,,
DMVDCYFTPASELDDSDSELKLPTAQR,ph,S,394,true,"Phospho cell culture sucrose/TOR",109,30833711,,,0.9420830,,,,,
