Peptide,PTM,ModifiedAA,ModifiedPosition,PeptideUniqueToGene,ExperimentDesc,ExpID,PubmedID,ScoreType,IdentScore,LocProb,Log2FChange,PQ-val,QuantSig,PEP,MassErrorPPM
MDKSSTMLVHYDKGTPAVANE,nta,M,1,false,"Arabidopsis translation initiation landscape - NTA",167a,35069635,,,,,,,,
MDKSSTMLVHYDKGTPAVAN,nta,M,1,false,"HUNTER N-terminome: legumain, GluC and trypsin",119,31951383,"MaxQuant score",,,,,,,
MDKSSTMLVHYD,nta,M,1,false,"Arg/N-end rule seed, prt6 vs. Wt",99,29168982,"MASCOT Score",51.7800000,,-0.1182708,0.3155863,NO,4.7600001380488E-6,-2.6623318
MDKSSTMLVHY,nta,M,1,false,"Arg/N-end rule seed, prt6 vs. Wt",99,29168982,"MASCOT Score",52.4400000,,-0.2667038,0.1209807,NO,0.010069999843836,-1.7163492
MDKSSTMLVH,nta,M,1,false,"Arg/N-end rule seed, prt6 vs. Wt",99,29168982,"MASCOT Score",56.5000000,,0.0500210,0.6436613,NO,0.01556000020355,-2.0304355
VLPEMILICQNLR,so,C,98,false,"S-sulfenylation site detection using YAP1C",110,32714340,,,,,,,,
VLSTEQDPSAKR,ac,K,188,false,"Quantitative Acetylproteomics",101,29440448,,,,,,,,
AVNYLLSNVDK,ph,Y,206,false,"Sucrose-induced phosphorylation",24,17586839,,,,,,,,
AVNYLLSNVDK,ph,S,209,false,"Sucrose-induced phosphorylation",24,17586839,,,,,,,,
AAANTYCQLLLSQSDNNVK,so,C,284,false,"Arabidopsis S-sulfenylation chemoproteomics",108,31578252,"pFind PSM Score",0.0002552,,1.3288200,,,,-0.8061087
EVVKTQSGELEK,ac,K,362,false,"Quantitative Acetylproteomics",101,29440448,,,,,,,,
KEVVKTQSGELEK,ub,K,362,false,"Protein ubiquitination during photomorphogenesis",3,28461270,,,,,,,,
EVVKTQSGELEK,ph,S,365,false,"Tissue atlas Arabidopsis - ProteomicsDB",114,32188942,"MaxQuant score",136.3900000,0.9926900,,,,5.3390799621411E-6,
TQSGELEK,ph,S,365,false,"atm and atr DNA damage response",88,25561503,"MASCOT Score",28.0000000,1.0000000,,,,,0.0400000
QMLIQAIHACAVK,so,C,385,false,"Arabidopsis S-sulfenylation chemoproteomics",108,31578252,"pFind PSM Score",0.0011386,,2.2304300,,,,-0.9436522
EIIETNPKLR,ac,K,428,false,"Quantitative Acetylproteomics",101,29440448,,,,,,,,
EIIETNPKLR,ub,K,428,false,"Arabidopsis ubiquitination COFRADIC",40,26744219,"MaxQuant Score",59.9080000,1.0000000,,,,0.0049999998882413,-0.0590000
EIIETNPKLR,ub,K,428,false,"upl3 mutant / wildtype",168,35926874,"MaxQuant score",185.6000000,1.0000000,0.2448871,0.6475600,NO,2.0503700959296E-9,-0.5966400
IQPTSSAMVSSR,ph,S,503,false,"Tissue atlas Arabidopsis - ProteomicsDB",114,32188942,"MaxQuant score",106.3300000,0.8423600,,,,0.00012313699699007,
IQPTSSAMVSSR,ph,S,504,false,"Tissue atlas Arabidopsis - ProteomicsDB",114,32188942,"MaxQuant score",147.7500000,0.9687190,,,,7.0286199616021E-7,
IQPTSSAMVSSR,ph,S,508,false,"Tissue atlas Arabidopsis - ProteomicsDB",114,32188942,"MaxQuant score",103.1400000,0.9035570,,,,8.7640000856481E-5,
KPVILADGTYATQSAASETTFSSPTVVQGSLTSGNLR,ph,S,532,false,"Tissue atlas Arabidopsis - ProteomicsDB",114,32188942,"MaxQuant score",198.3900000,0.9152570,,,,0,
KPVILADGTYATQSAASETTFSSPTVVQGSLTSGNLR,ph,S,533,false,"Tissue atlas Arabidopsis - ProteomicsDB",114,32188942,"MaxQuant score",207.6700000,0.7610970,,,,0,
IWLESCR,acy,C,639,false,"Arabidopsis S-acylation atlas - Meristem",163a,35681017,,,,,,,,
IWLESCR,acy,C,639,false,"Arabidopsis S-acylation atlas - Silique",163e,35681017,,,,,,,,
IWLESCRQSFVK,ph,S,642,false,"Tissue atlas Arabidopsis - ProteomicsDB",114,32188942,"MaxQuant score",101.3000000,0.8403820,,,,3.1802599551156E-5,
EMEELKAK,ac,K,659,false,"Quantitative Acetylproteomics",101,29440448,,,,,,,,
TQTTHAQPDDLIDFFHLKSR,ph,S,680,false,"Tissue atlas Arabidopsis - ProteomicsDB",114,32188942,"MaxQuant score",106.0400000,1.0000000,,,,1.1530599808296E-9,
KGMSQLELEDQVQDDLKR,ph,S,685,false,"Tissue atlas Arabidopsis - ProteomicsDB",114,32188942,"MaxQuant score",191.1800000,1.0000000,,,,1.4012984643248E-45,
GMSQLELEDQVQDDLKR,ph,S,685,false,"Ethylene-regulated phosphorylation ein2 mutant",30,19253305,"MASCOT Score",61.6162000,,,,,,48.8766630
KGMSQLELEDQVQDDLKR,ac,K,698,false,"Quantitative Acetylproteomics",101,29440448,,,,,,,,
ATGEFTKDENDANKLNR,ub,K,706,false,"Arabidopsis ubiquitination COFRADIC",40,26744219,"MaxQuant Score",41.0880000,0.9990000,,,,0.0049999998882413,-0.6950000
ATGEFTKDENDANKLNR,ub,K,706,false,"upl3 mutant / wildtype",168,35926874,"MaxQuant score",217.2000000,1.0000000,1.4740466,0.1556960,NO,2.7845299766007E-29,-0.1183100
ATGEFTKDENDANKLNR,ub,K,713,false,"Ubiquitination Membrane Proteins",120,33585938,,,,,,,,
ATGEFTKDENDANKLNR,ub,K,713,false,"upl3 mutant / wildtype",168,35926874,"MaxQuant score",217.2000000,1.0000000,1.4740466,0.1556960,NO,2.7845299766007E-29,-0.1183100
DENDANKLNR,ub,K,713,false,"upl3 mutant / wildtype",168,35926874,"MaxQuant score",250.2700000,1.0000000,0.0510240,0.9650800,NO,0,-1.1042000
GFSDPVYAE,nt,G,722,false,"Arg/N-end rule seed, prt6 vs. Wt",99,29168982,"MASCOT Score",36.0600000,,-0.4397597,0.0090758,NO,0.035689998418093,-0.6658930
ETLQNLCLELATMGDLK,so,C,758,false,"S-sulfenylation site detection using YAP1C",110,32714340,,,,,,,,
DYISPAVCSE,nt,D,828,false,"Arg/N-end rule seed, prt6 vs. Wt",99,29168982,"MASCOT Score",42.5500000,,-0.0764643,0.9046266,NO,0.0038900000508875,-3.5160020
EFLDHIIKSTNMK,ub,K,871,false,"upl3 mutant / wildtype",168,35926874,"MaxQuant score",67.1180000,1.0000000,-0.4560093,0.4963600,NO,0.00040866300696507,1.8526000
LTAPSAIAGE,nt,L,878,true,"Arg/N-end rule seed, prt6 vs. Wt",99,29168982,"MASCOT Score",31.1000000,,-0.0937266,0.6940358,NO,0.051399998366833,-0.4537163
