Peptide,PTM,ModifiedAA,ModifiedPosition,PeptideUniqueToGene,ExperimentDesc,ExpID,PubmedID,ScoreType,IdentScore,LocProb,Log2FChange,PQ-val,QuantSig,PEP,MassErrorPPM
VFVFGSFTEHETR,ph,S,11,true,"Tissue atlas Arabidopsis - ProteomicsDB",114,32188942,"MaxQuant score",114.6300000,0.9949730,,,,2.518979999877E-5,
LDASRPASSDKNNDSDAK,ph,S,81,true,"Tissue atlas Arabidopsis - ProteomicsDB",114,32188942,"MaxQuant score",93.4040000,0.9998910,,,,1.2532799701148E-5,
LDASRPASSDKNNDSDAK,ph,S,85,true,"STN8 phosphoproteome",38,21768351,"MASCOT Score",47.4300000,,,,,,-0.3040830
LDASRPASSDKNNDSDAK,ph,S,85,true,"Chloroplast kinase substrates",60,19376835,"MASCOT Score",40.1000000,,,,,,-0.5169720
LDASRPASSDKNNDSDAK,ph,S,85,true,"SnRK2 protein kinase substrates",85,23776212,XCorr,3.0482180,0.8540000,,,,0.017435800284147,
PASSDKNNDSDAKLPR,ph,S,85,true,"Tissue atlas Arabidopsis - ProteomicsDB",114,32188942,"MaxQuant score",180.0500000,0.9832860,,,,7.2545500412542E-36,
PASSDKNNDSDAK,ph,S,85,true,"atm and atr DNA damage response",88,25561503,"MASCOT Score",53.0000000,0.9500000,,,,,-1.7500000
LDASRPASSDKNNDSDAKLPR,ph,S,86,true,"Phosphoproteome ethylene-regulated time response",46,24043427,"MASCOT Score",90.6700000,,,,,,-11.7434000
LDASRPASSDKNNDSDAK,ph,S,86,true,"Col-0 callus - FC Col-0 vs. Col-0 Xray",111a,31410901,,21.1500000,,0.4616726,0.0000000,NO,,-1.0014320
LDASRPASSDKNNDSDAK,ph,S,86,true,"Col-0 X-ray callus - FC Col-0 vs. Col-0 Xray",111b,31410901,,21.1500000,,0.4616726,0.0000000,NO,,-1.0014320
LDASRPASSDKNNDSDAK,ph,S,86,true,"atm callus - FC atm vs. atm Xray",111c,31410901,,21.1500000,,0.0740451,0.0000000,NO,,-1.0014320
LDASRPASSDKNNDSDAK,ph,S,86,true,"atm-3 X-ray callus - FC atm vs. atm Xray",111d,31410901,,21.1500000,,0.0740451,0.0000000,NO,,-1.0014320
NNDSDAKLPR,ph,S,92,true,"Tissue atlas Arabidopsis - ProteomicsDB",114,32188942,"MaxQuant score",58.0980000,1.0000000,,,,0.0082261404022574,
KNSLRVPEHVVQNGIIK,ph,S,101,true,"Tyrosine phosphorylation in Arabidopsis",59,18463617,"MASCOT Score",22.0000000,,,,,,-1.1939851
KNSLRVPEHVVQNGIIK,ph,S,101,true,"TOR Kinase and ABA Receptor",100,29290610,XCorr,3.7530320,1.0000000,,,,0.00024990001111291,
NSLRVPEHVVQNGIIK,ph,S,101,true,"Phospho cell culture sucrose/TOR",109,30833711,,,1.0000000,,,,,
NSLRVPEHVVQNGIIK,ph,S,101,true,"Tissue atlas Arabidopsis - ProteomicsDB",114,32188942,"MaxQuant score",252.9100000,1.0000000,,,,0,
EISESNKSLNNGVAVK,ph,S,120,true,"Tissue atlas Arabidopsis - ProteomicsDB",114,32188942,"MaxQuant score",167.1800000,0.9988170,,,,8.6497397775269E-19,
EISESNKSLNNGVAVK,ph,S,123,true,"Tissue atlas Arabidopsis - ProteomicsDB",114,32188942,"MaxQuant score",88.2430000,0.9999610,,,,0.00012447699555196,
TDPIGLDNLSMSDGESDPVYK,ph,S,141,true,"Large-scale phosphorylation discovery",44,23111157,XCorr,4.6200000,,,,,,
TDPIGLDNLSMSDGESDPVYK,ph,S,141,true,"Conserved plant phosphoproteome - Arabidopsis",61a,20466843,"MASCOT Score",22.0000000,1.0000000,,,,,
TDPIGLDNLSMSDGESDPVYK,ph,S,141,true,"srk2dei ABA signaling phopshoproteomics",83,23572148,"MASCOT Score",87.0000000,,,,,,-0.0006000
TDPIGLDNLSMSDGESDPVYK,ph,S,141,true,"Lateral root-induction - NAA vs control",106,23328941,"MASCOT Score",73.0000000,,,,,,
TDPIGLDNLSMSDGESDPVYK,ph,S,141,true,"Phospho cell culture sucrose/TOR",109,30833711,,,0.9999200,,,,,
TDPIGLDNLSMSDGESDPVYK,ph,S,141,true,"Tissue atlas Arabidopsis - ProteomicsDB",114,32188942,"MaxQuant score",162.3900000,0.9996030,,,,3.5455298225321E-30,
TDPIGLDNLSMSDGESDPVYK,ph,S,143,true,"Arabidopsis root NAA phosphoproteome",18a,27643528,"MaxQuant Score",89.7230000,0.9190000,,,,9.2069997459365E-12,-1.7120000
TDPIGLDNLSMSDGESDPVYK,ph,S,143,true,"Phosphorylation nuclei-enriched fractions",28,19245862,,,,,,,,
TDPIGLDNLSMSDGESDPVYK,ph,S,143,true,"Large-scale phosphorylation discovery",44,23111157,XCorr,6.0000000,,,,,,
TDPIGLDNLSMSDGESDPVYK,ph,S,143,true,"PAMP-triggered phosphorylation",48,24601666,"MASCOT Score",77.3600000,,,,,,
TDPIGLDNLSMSDGESDPVYK,ph,S,143,true,"Tyrosine phosphorylation in Arabidopsis",59,18463617,"MASCOT Score",92.0000000,,,,,,-1.8010464
TDPIGLDNLSMSDGESDPVYK,ph,S,143,true,"Conserved plant phosphoproteome - Arabidopsis",61a,20466843,"MASCOT Score",22.0000000,1.0000000,,,,,
TDPIGLDNLSMSDGESDPVYK,ph,S,143,true,"srk2dei ABA signaling phopshoproteomics",83,23572148,"MASCOT Score",92.0000000,,,,,,0.0000000
TDPIGLDNLSMSDGESDPVYK,ph,S,143,true,"LAXIC - ABA stress",84a,23660473,XCorr,5.5400000,0.9930000,,,,0.0017975099617615,
TDPIGLDNLSMSDGESDPVYK,ph,S,143,true,"LAXIC - mannitol vs control",84b,23660473,XCorr,5.1200000,0.9960000,,,,0.00020429100550245,
TDPIGLDNLSMSDGESDPVYK,ph,S,143,true,"SnRK2 protein kinase substrates",85,23776212,XCorr,4.8762455,0.9970000,,,,0.0012810199987143,
TDPIGLDNLSMSDGESDPVYK,ph,S,143,true,"atm and atr DNA damage response",88,25561503,"MASCOT Score",35.0000000,1.0000000,,,,,-0.2100000
TDPIGLDNLSMSDGESDPVYK,ph,S,143,true,"Protein sumoylation and phosphorylation cross-talk",97,28419593,,,,,,,,
TDPIGLDNLSMSDGESDPVYK,ph,S,143,true,"TOR Kinase and ABA Receptor",100,29290610,XCorr,5.6691518,0.9919000,,,,1.0490000477148E-6,
TDPIGLDNLSMSDGESDPVYK,ph,S,143,true,"Lateral root-induction - NAA vs control",106,23328941,"MASCOT Score",73.0000000,,,,,,
TDPIGLDNLSMSDGESDPVYK,ph,S,143,true,"Phospho cell culture sucrose/TOR",109,30833711,,,0.9939970,,,,,
TDPIGLDNLSMSDGESDPVYK,ph,S,143,true,"Col-0 callus - FC Col-0 vs. Col-0 Xray",111a,31410901,,73.9900000,,0.9484277,0.0000000,NO,,-1.9121003
TDPIGLDNLSMSDGESDPVYK,ph,S,143,true,"Col-0 X-ray callus - FC Col-0 vs. Col-0 Xray",111b,31410901,,73.9900000,,0.9484277,0.0000000,NO,,-1.9121003
TDPIGLDNLSMSDGESDPVYK,ph,S,143,true,"atm callus - FC atm vs. atm Xray",111c,31410901,,73.9900000,,1.9159258,0.0000000,NO,,-1.9121003
TDPIGLDNLSMSDGESDPVYK,ph,S,143,true,"atm-3 X-ray callus - FC atm vs. atm Xray",111d,31410901,,73.9900000,,1.9159258,0.0000000,NO,,-1.9121003
TDPIGLDNLSMSDGESDPVYK,ph,S,143,true,"Tissue atlas Arabidopsis - ProteomicsDB",114,32188942,"MaxQuant score",357.0300000,0.9999420,,,,0,
TDPIGLDNLSMSDGESDPVYK,ph,S,143,true,"Touch-induced phosphorylation: 40s touch vs untouc",136,30291188,"MASCOT score",93.5600000,,-0.0967284,0.8115493,NO,,-0.2510429
TDPIGLDNLSMSDGESDPVYK,ph,S,147,true,"srk2dei ABA signaling phopshoproteomics",83,23572148,"MASCOT Score",23.0000000,,,,,,0.0009000
TDPIGLDNLSMSDGESDPVYK,ph,S,147,true,"Lateral root-induction - NAA vs control",106,23328941,"MASCOT Score",21.0000000,,,,,,
FQALDNEDFSSDSSSGSIQR,ph,S,167,true,"SnRK2 protein kinase substrates",85,23776212,XCorr,3.8631897,0.9630000,,,,2.9105300200172E-5,
FQALDNEDFSSDSSSGSIQR,ph,S,167,true,"Tissue atlas Arabidopsis - ProteomicsDB",114,32188942,"MaxQuant score",168.7900000,0.8781640,,,,3.2580301040697E-35,
FQALDNEDFSSDSSSGSIQR,ph,S,168,true,"atm and atr DNA damage response",88,25561503,"MASCOT Score",36.0000000,0.9360000,,,,,-0.2300000
FQALDNEDFSSDSSSGSIQR,ph,S,168,true,"Tissue atlas Arabidopsis - ProteomicsDB",114,32188942,"MaxQuant score",367.8500000,0.9774770,,,,0,
FQALDNEDFSSDSSSGSIQR,ph,S,170,true,"SnRK2 protein kinase substrates",85,23776212,XCorr,3.9724979,0.9150000,,,,0.0006781269912608,
FQALDNEDFSSDSSSGSIQR,ph,S,170,true,"Tissue atlas Arabidopsis - ProteomicsDB",114,32188942,"MaxQuant score",207.0700000,0.9323030,,,,0,
FQALDNEDFSSDSSSGSIQR,ph,S,171,true,"atm and atr DNA damage response",88,25561503,"MASCOT Score",36.0000000,0.9360000,,,,,-0.2300000
NNVTVVEAGR,ng,N,262,true,"Conserved N-glycosylation",74,22633491,"MaxQuant Score",96.4050000,0.9910000,,,,0.0010000000474975,0.1510000
TQSFVPSELSEIFGGQLK,ph,T,358,true,"MAPK Arabidopsis substrates",45,23172892,"MaxQuant Score",105.7900000,,,,,,
TQSFVPSELSEIFGGQLK,ph,S,360,true,"TOR Kinase and ABA Receptor",100,29290610,XCorr,5.1282392,0.9213000,,,,1.0569999986387E-8,
TQSFVPSELSEIFGGQLK,ph,S,360,true,"Lateral root-induction - NAA vs control",106,23328941,"MASCOT Score",27.0000000,,,,,,
ASVTGKTGVVSASK,ph,T,431,true,"Tissue atlas Arabidopsis - ProteomicsDB",114,32188942,"MaxQuant score",153.0300000,0.9999930,,,,3.8278901115518E-7,
FSYGSQGSTK,ph,S,460,true,"Tissue atlas Arabidopsis - ProteomicsDB",114,32188942,"MaxQuant score",79.2830000,0.9360610,,,,0.0031735200900584,
