Peptide,PTM,ModifiedAA,ModifiedPosition,PeptideUniqueToGene,ExperimentDesc,ExpID,PubmedID,ScoreType,IdentScore,LocProb,Log2FChange,PQ-val,QuantSig,PEP,MassErrorPPM
LWSPGTSSSTMAPAK,ph,S,50,true,"Large-scale phosphorylation discovery",44,23111157,XCorr,3.8610000,,,,,,
LWSPGTSSSTMAPAK,ph,S,50,true,"TOR Kinase and ABA Receptor",100,29290610,XCorr,3.2629387,0.9944000,,,,0.0045409998856485,
LWSPGTSSSTMAPAK,ph,S,50,true,"Tissue atlas Arabidopsis - ProteomicsDB",114,32188942,"MaxQuant score",183.0000000,1.0000000,,,,1.0706400484137E-25,
LWSPGTSSSTMAPAK,ph,T,53,true,"atm and atr DNA damage response",88,25561503,"MASCOT Score",33.0000000,0.9960000,,,,,-0.4000000
KSPSLLELIQMK,ph,S,81,true,"Phosphoproteome ethylene-regulated time response",46,24043427,"MASCOT Score",53.1700000,,,,,,-18.0068000
KSPSLLELIQMK,ph,S,81,true,"atm and atr DNA damage response",88,25561503,"MASCOT Score",24.0000000,1.0000000,,,,,-0.9400000
KSPSLLELIQMK,ph,S,81,true,"TOR Kinase and ABA Receptor",100,29290610,XCorr,4.5791764,1.0000000,,,,2.9949999316159E-6,
KSPSLLELIQMK,ph,S,81,true,"Tissue atlas Arabidopsis - ProteomicsDB",114,32188942,"MaxQuant score",194.5800000,0.9991990,,,,1.4917799507684E-24,
SPSLLELIQMK,ph,S,81,true,"TOR Kinase and ABA Receptor",100,29290610,XCorr,4.5030904,0.9961000,,,,3.3799999073381E-5,
TIAAAASVGPTLAPGSIEK,ph,S,132,true,"Tissue atlas Arabidopsis - ProteomicsDB",114,32188942,"MaxQuant score",202.1600000,0.9999920,,,,0,
QPEIAIDSPYFDAR,ph,S,284,true,"Tissue atlas Arabidopsis - ProteomicsDB",114,32188942,"MaxQuant score",165.5800000,0.9998220,,,,8.6545900654378E-12,
TDCGQIEAPGIHQSMSLSDFLAVLCDTK,ph,S,383,true,"Large-scale phosphorylation discovery",44,23111157,XCorr,5.2890000,,,,,,
VNSLFNLLYK,ph,S,495,true,"TOR Kinase and ABA Receptor",100,29290610,XCorr,3.9920535,1.0000000,,,,0.00013420000323094,
VLDTASSSKPQGMLR,ph,S,546,true,"Tissue atlas Arabidopsis - ProteomicsDB",114,32188942,"MaxQuant score",139.3400000,0.9941740,,,,1.0251500270897E-6,
KDSFSDLLLHLPR,ph,S,558,true,"Phosphoproteome iron-deficient Arabidopsis roots",41,22438062,"MASCOT Score",46.6900000,,,,,,
KDSFSDLLLHLPR,ph,S,558,true,"MAPK Arabidopsis substrates",45,23172892,"MaxQuant Score",134.6100000,,,,,,
KDSFSDLLLHLPR,ph,S,558,true,"PAMP-triggered phosphorylation",48,24601666,"MASCOT Score",42.3000000,,,,,,
KDSFSDLLLHLPR,ph,S,558,true,"atm and atr DNA damage response",88,25561503,"MASCOT Score",55.0000000,0.9740000,,,,,0.0200000
KDSFSDLLLHLPR,ph,S,558,true,"TOR Kinase and ABA Receptor",100,29290610,XCorr,4.3750315,0.9401000,,,,2.7809999664896E-5,
KDSFSDLLLHLPR,ph,S,558,true,"Phospho cell culture sucrose/TOR",109,30833711,,,0.9964740,,,,,
KDSFSDLLLHLPR,ph,S,558,true,"Tissue atlas Arabidopsis - ProteomicsDB",114,32188942,"MaxQuant score",221.1300000,0.9997470,,,,0,
DSFSDLLLHLPR,ph,S,558,true,"TOR Kinase and ABA Receptor",100,29290610,XCorr,3.4090209,0.9993000,,,,0.0053340001031756,
KDSFSDLLLHLPR,ph,S,560,true,"MAPK Arabidopsis substrates",45,23172892,"MaxQuant Score",91.3070000,,,,,,
KDSFSDLLLHLPR,ph,S,560,true,"Col-0 callus - FC Col-0 vs. Col-0 Xray",111a,31410901,,46.4500000,,0.3815989,0.0000000,NO,,-0.2183484
KDSFSDLLLHLPR,ph,S,560,true,"Col-0 X-ray callus - FC Col-0 vs. Col-0 Xray",111b,31410901,,46.4500000,,0.3815989,0.0000000,NO,,-0.2183484
KDSFSDLLLHLPR,ph,S,560,true,"atm callus - FC atm vs. atm Xray",111c,31410901,,46.4500000,,0.5382150,0.0000000,NO,,-0.2183484
KDSFSDLLLHLPR,ph,S,560,true,"atm-3 X-ray callus - FC atm vs. atm Xray",111d,31410901,,46.4500000,,0.5382150,0.0000000,NO,,-0.2183484
FLSNISEEDGDAYNR,ph,S,580,true,"Tissue atlas Arabidopsis - ProteomicsDB",114,32188942,"MaxQuant score",147.1200000,1.0000000,,,,1.4108199941631E-8,
