Peptide,PTM,ModifiedAA,ModifiedPosition,PeptideUniqueToGene,ExperimentDesc,ExpID,PubmedID,ScoreType,IdentScore,LocProb,Log2FChange,PQ-val,QuantSig,PEP,MassErrorPPM
ADLSGAATPDSSFPEPEIKLSSR,nt,A,102,true,"N-terminal ChaFRADIC",92,26010716,"MASCOT Score",31.0000000,,,,,2.0330001007096E-6,
ADLSGAATPDSSFPEPE,nt,A,102,true,"N-terminal ChaFRADIC",92,26010716,"MASCOT Score",57.0300000,,,,,5.2120001782896E-5,
ADLSGAATPDSSFPEPE,nt,A,102,true,"HUNTER N-terminome: legumain, GluC and trypsin",119,31951383,"MaxQuant score",83.0450000,,,,,,
ADLSGAATPDSSFPEPEIKLSSR,nta,A,102,true,"N-terminal ChaFRADIC",92,26010716,"MASCOT Score",31.0000000,,,,,2.0330001007096E-6,
ADLSGAATPDSSFPEPEIKLSSR,nta,A,102,true,"HUNTER N-terminome: legumain, GluC and trypsin",119,31951383,"MaxQuant score",82.5040000,,,,,,
ADLSGAATPDSSFPEPE,nta,A,102,true,"N-terminal ChaFRADIC",92,26010716,"MASCOT Score",27.7700000,,,,,0.012099999934435,
SQVDCLK,sno,C,255,true,"hot5-4 / wildtype, FAT-switch S-nitrosoproteome",169,37277371,,,,0.5161260,0.1135462,NO,,
CMELLK,sno,C,259,true,"hot5-4 / wildtype, FAT-switch S-nitrosoproteome",169,37277371,,,,,,,,
ADVLCNEAR,sno,C,343,true,"hot5-4 / wildtype, FAT-switch S-nitrosoproteome",169,37277371,,,,0.0554162,0.8748762,NO,,
