Peptide,PTM,ModifiedAA,ModifiedPosition,PeptideUniqueToGene,ExperimentDesc,ExpID,PubmedID,ScoreType,IdentScore,LocProb,Log2FChange,PQ-val,QuantSig,PEP,MassErrorPPM
VLIESSESEDEILIKNEPK,ph,S,6,true,"Tissue atlas Arabidopsis - ProteomicsDB",114,32188942,"MaxQuant score",226.0600000,1.0000000,,,,0,
VLIESSESEDEILIK,ph,S,6,true,"Tyrosine phosphorylation in Arabidopsis",59,18463617,"MASCOT Score",51.0000000,,,,,,-1.0096182
VLIESSESEDEILIK,ph,S,6,true,"Chloroplast kinase substrates",60,19376835,"MASCOT Score",38.9700000,,,,,,-0.7316370
VLIESSESEDEILIK,ph,S,6,true,"Conserved plant phosphoproteome - Arabidopsis",61a,20466843,"MASCOT Score",35.0000000,1.0000000,,,,,
VLIESSESEDEILIK,ph,S,6,true,"srk2dei ABA signaling phopshoproteomics",83,23572148,"MASCOT Score",34.0000000,,,,,,0.0004000
VLIESSESEDEILIK,ph,S,6,true,"Brassinosteroid-Regulated Phosphorylation Dynamics",94,26187819,"MaxQuant Score",171.0000000,1.0000000,,,,1.8960000737933E-14,-0.3320000
VLIESSESEDEILIK,ph,S,6,true,"Phospho cell culture sucrose/TOR",109,30833711,,,1.0000000,,,,,
VLIESSESEDEILIKNEPK,ph,S,7,true,"Tissue atlas Arabidopsis - ProteomicsDB",114,32188942,"MaxQuant score",241.9800000,1.0000000,,,,0,
VLIESSESEDEILIK,ph,S,7,true,"Tyrosine phosphorylation in Arabidopsis",59,18463617,"MASCOT Score",28.0000000,,,,,,-0.6169887
VLIESSESEDEILIK,ph,S,7,true,"Conserved plant phosphoproteome - Arabidopsis",61a,20466843,"MASCOT Score",28.0000000,1.0000000,,,,,
VLIESSESEDEILIK,ph,S,7,true,"srk2dei ABA signaling phopshoproteomics",83,23572148,"MASCOT Score",56.0000000,,,,,,-0.0005000
VLIESSESEDEILIK,ph,S,7,true,"Brassinosteroid-Regulated Phosphorylation Dynamics",94,26187819,"MaxQuant Score",171.0000000,1.0000000,,,,1.8960000737933E-14,-0.3320000
VLIESSESEDEILIKNEPK,ph,S,9,true,"Tissue atlas Arabidopsis - ProteomicsDB",114,32188942,"MaxQuant score",226.0600000,1.0000000,,,,0,
VLIESSESEDEILIK,ph,S,9,true,"Tyrosine phosphorylation in Arabidopsis",59,18463617,"MASCOT Score",57.0000000,,,,,,-0.8974384
VLIESSESEDEILIK,ph,S,9,true,"Chloroplast kinase substrates",60,19376835,"MASCOT Score",38.9700000,,,,,,-0.7316370
VLIESSESEDEILIK,ph,S,9,true,"Conserved plant phosphoproteome - Arabidopsis",61a,20466843,"MASCOT Score",31.0000000,1.0000000,,,,,
VLIESSESEDEILIK,ph,S,9,true,"srk2dei ABA signaling phopshoproteomics",83,23572148,"MASCOT Score",56.0000000,,,,,,-0.0005000
VLIESSESEDEILIK,ph,S,9,true,"Brassinosteroid-Regulated Phosphorylation Dynamics",94,26187819,"MaxQuant Score",171.0000000,1.0000000,,,,1.8960000737933E-14,-0.3320000
PASSSSPQPTETK,ph,S,26,true,"Tissue atlas Arabidopsis - ProteomicsDB",114,32188942,"MaxQuant score",209.8400000,0.9998520,,,,0,
QVDGDDSDGFETASER,ph,S,40,true,"STN8 phosphoproteome",38,21768351,"MASCOT Score",46.3600000,,,,,,
QVDGDDSDGFETASER,ph,S,40,true,"Tyrosine phosphorylation in Arabidopsis",59,18463617,"MASCOT Score",67.0000000,,,,,,-0.4428067
QVDGDDSDGFETASER,ph,S,40,true,"LAXIC - mannitol vs control",84b,23660473,XCorr,3.8900000,1.0000000,,,,1.9700000564171E-7,
QVDGDDSDGFETASER,ph,S,40,true,"atm and atr DNA damage response",88,25561503,"MASCOT Score",60.0000000,1.0000000,,,,,-0.7100000
QVDGDDSDGFETASER,ph,S,40,true,"Lateral root-induction - NAA vs control",106,23328941,"MASCOT Score",32.0000000,,,,,,
QVDGDDSDGFETASER,ph,S,40,true,"Tissue atlas Arabidopsis - ProteomicsDB",114,32188942,"MaxQuant score",268.4200000,1.0000000,,,,0,
QVDGDDSDGFETASER,ph,T,45,true,"SnRK2 protein kinase substrates",85,23776212,XCorr,4.1371102,0.9990000,,,,3.7648800343959E-7,
QVDGDDSDGFETASER,ph,T,45,true,"atm and atr DNA damage response",88,25561503,"MASCOT Score",60.0000000,1.0000000,,,,,-0.7100000
QVDGDDSDGFETASER,ph,S,47,true,"Lateral root-induction - NAA vs control",106,23328941,"MASCOT Score",32.0000000,,,,,,
QVDGDDSDGFETASER,ph,S,47,true,"Tissue atlas Arabidopsis - ProteomicsDB",114,32188942,"MaxQuant score",194.1900000,1.0000000,,,,1.2565499381539E-35,
EISDEEGEEDGTKNDAVTSQEEPQHSEKK,ph,S,52,true,"STN8 phosphoproteome",38,21768351,"MASCOT Score",70.1100000,,,,,,-0.5935100
EISDEEGEEDGTKNDAVTSQEEPQHSEKK,ph,S,52,true,"Tissue atlas Arabidopsis - ProteomicsDB",114,32188942,"MaxQuant score",410.3700000,1.0000000,,,,0,
EISDEEGEEDGTKNDAVTSQEEPQHSEK,ph,S,52,true,"STN8 phosphoproteome",38,21768351,"MASCOT Score",65.6500000,,,,,,-1.5800000
EISDEEGEEDGTKNDAVTSQEEPQHSEK,ph,S,52,true,"Chloroplast kinase substrates",60,19376835,"MASCOT Score",49.1200000,,,,,,-0.7360700
EISDEEGEEDGTKNDAVTSQEEPQHSEK,ph,S,52,true,"LAXIC - mannitol vs control",84b,23660473,XCorr,3.3500000,0.9680000,-2.1023850,,NO,8.9700000671655E-7,
EISDEEGEEDGTKNDAVTSQEEPQHSEK,ph,S,52,true,"Col-0 callus - FC Col-0 vs. Col-0 Xray",111a,31410901,,50.4100000,,-0.4398229,0.0000000,NO,,1.0066460
EISDEEGEEDGTKNDAVTSQEEPQHSEK,ph,S,52,true,"Col-0 X-ray callus - FC Col-0 vs. Col-0 Xray",111b,31410901,,50.4100000,,-0.4398229,0.0000000,NO,,1.0066460
EISDEEGEEDGTKNDAVTSQEEPQHSEK,ph,S,52,true,"atm callus - FC atm vs. atm Xray",111c,31410901,,50.4100000,,0.3115599,0.0000000,NO,,1.0066460
EISDEEGEEDGTKNDAVTSQEEPQHSEK,ph,S,52,true,"atm-3 X-ray callus - FC atm vs. atm Xray",111d,31410901,,50.4100000,,0.3115599,0.0000000,NO,,1.0066460
EISDEEGEEDGTK,ph,S,52,true,"Pollen phosphoproteome Arabidopsis",43,22631563,"MASCOT Score",36.4600000,,,,,,-2.5013100
EISDEEGEEDGTK,ph,S,52,true,"LAXIC - mannitol vs control",84b,23660473,XCorr,2.8200000,1.0000000,,,,4.9900000931302E-7,
EISDEEGEEDGTK,ph,S,52,true,"SnRK2 protein kinase substrates",85,23776212,XCorr,2.9132063,1.0000000,,,,0.0037933199200779,
EISDEEGEEDGTK,ph,S,52,true,"atm and atr DNA damage response",88,25561503,"MASCOT Score",50.0000000,1.0000000,,,,,-0.6100000
EISDEEGEEDGTK,ph,S,52,true,"TOR Kinase and ABA Receptor",100,29290610,XCorr,3.0725036,1.0000000,,,,0.00033360000816174,
EISDEEGEEDGTKNDAVTSQEEPQHSEK,ph,T,61,true,"SnRK2 protein kinase substrates",85,23776212,XCorr,3.6146417,0.8790000,,,,0.005229540169239,
NDAVTSQEEPQHSEK,ph,S,75,true,"TOR Kinase and ABA Receptor",100,29290610,XCorr,4.0918980,1.0000000,,,,1.5350000467151E-5,
KEEQIELMSEGEAIVDDGSNKEK,ph,S,86,true,"SnRK2 protein kinase substrates",85,23776212,XCorr,5.4920726,1.0000000,,,,0.0025509500410408,
KEEQIELMSEGEAIVDDGSNKEK,ph,S,86,true,"Phospho cell culture sucrose/TOR",109,30833711,,,1.0000000,,,,,
KEEQIELMSEGEAIVDDGSNKEK,ph,S,86,true,"Tissue atlas Arabidopsis - ProteomicsDB",114,32188942,"MaxQuant score",326.3700000,1.0000000,,,,0,
KEEQIELMSEGEAIVDDGSNK,ph,S,86,true,"srk2dei ABA signaling phopshoproteomics",83,23572148,"MASCOT Score",58.0000000,,,,,,-0.0005000
KEEQIELMSEGEAIVDDGSNK,ph,S,86,true,"TOR Kinase and ABA Receptor",100,29290610,XCorr,4.8584299,1.0000000,,,,1.064000025508E-5,
SICYLNR,so,C,148,true,"S-sulfenylation site detection using YAP1C",110,32714340,,,,,,,,
GVCFLK,ox,C,155,true,"OxiTRAQ Arabidopsis - 5 mM H2O2 versus control",47,24376095,,,,-0.0885865,0.6547604,NO,,
