Peptide,PTM,ModifiedAA,ModifiedPosition,PeptideUniqueToGene,ExperimentDesc,ExpID,PubmedID,ScoreType,IdentScore,LocProb,Log2FChange,PQ-val,QuantSig,PEP,MassErrorPPM
TTAELNPFPSR,nt,T,2,true,"Arg/N-end rule seed, prt6 vs. Wt",99,29168982,"MASCOT Score",52.3300000,,,,,0.05426000058651,-1.4172784
TTAELNPFPSR,nt,T,2,true,"FtsH12 N-terminome: WT / FtsH12 knockdown miRNA",118,33216923,"MaxQuant score",225.1000000,,0.4230057,0.0492790,NO,0,
TTAELNPFPS,nt,T,2,true,"N-term acetylation drought responses",5,26184543,,,,,,,,
TTAELNPFPSR,nta,T,2,true,"Characterization plant N-terminal acetylation",6,22223895,"MASCOT Score",61.9500000,,,,,,
TTAELNPFPSR,nta,T,2,true,"Arg/N-end rule seed, prt6 vs. Wt",99,29168982,"MASCOT Score",52.3300000,,,,,0.05426000058651,-1.4172784
TTAELNPFPSR,nta,T,2,true,"HUNTER N-terminome: legumain, GluC and trypsin",119,31951383,"MaxQuant score",138.2500000,,,,,,
TTAELNPFPSR,nta,T,2,true,"Arabidopsis translation initiation landscape - NTA",167a,35069635,,,,,,,,
TTAELNPFPS,nta,T,2,true,"N-term acetylation drought responses",5,26184543,,,,,,,,
SACSLANVSDVEVK,sno,C,72,true,"Site-specific nitrosomeproteomic id - gsnor1-3",90b,25699590,XCorr,2.1300000,,,,,0.0019769999198616,-7.3300000
INSFNSPVLQYCGGGVSPEMEPPK,ox,C,141,true,"SPEAR - 10 mM H2O2 / mock",138a,34619326,,,,-0.4573872,0.0199907,YES,,
HIVEHCNTHGHK,sno,C,456,true,"Site-specific nitrosomeproteomic id - gsnor1-3",90b,25699590,XCorr,2.4300000,,,,,0.0026559999678284,-5.7100000
