Peptide,PTM,ModifiedAA,ModifiedPosition,PeptideUniqueToGene,ExperimentDesc,ExpID,PubmedID,ScoreType,IdentScore,LocProb,Log2FChange,PQ-val,QuantSig,PEP,MassErrorPPM
SSLEDIKNETVDLEKIPIEEVFQQL,nta,S,2,true,"Arabidopsis translation initiation landscape - NTA",167a,35069635,,,,,,,,
SSLEDIKNETVDLEK,nta,S,2,true,"Characterization plant N-terminal acetylation",6,22223895,"MASCOT Score",82.9600000,,,,,,
SSLEDIKNETVDLEK,ph,S,2,true,"Tissue atlas Arabidopsis - ProteomicsDB",114,32188942,"MaxQuant score",262.2400000,0.9314110,,,,0,
SSLEDIKNETVDLEK,ph,S,3,true,"Tissue atlas Arabidopsis - ProteomicsDB",114,32188942,"MaxQuant score",281.9200000,0.9824260,,,,0,
SSLEDIKNETVDLEK,ac,K,8,true,"Histone deacetylases- hda14 vs WT (low light)",98c,29061669,"MaxQuant Score",80.3600000,1.0000000,0.1370000,0.9885531,NO,0.024000000208616,
SSLEDIKNETVDLEK,ub,K,8,true,"upl3 mutant / wildtype",168,35926874,"MaxQuant score",170.1100000,1.0000000,1.2147465,,,2.0705599472973E-22,-1.4102000
SSLEDIKNETVDLEK,ph,T,11,true,"Tissue atlas Arabidopsis - ProteomicsDB",114,32188942,"MaxQuant score",239.9300000,1.0000000,,,,0,
IPIEEVFQQLKCSR,ub,K,27,false,"Ubiquitination Membrane Proteins",120,33585938,,,,,,,,
IPIEEVFQQLKCSR,ub,K,27,false,"upl3 mutant / wildtype",168,35926874,"MaxQuant score",183.0000000,1.0000000,0.9664305,0.1437220,NO,4.3700701393607E-19,0.3851700
EGLTTQEGEDR,nt,E,31,false,"Arg/N-end rule pathway Roots",80,25728785,"MASCOT Score",43.4900000,,,,,0.01714999973774,
EGLTTQEGEDR,ph,T,35,false,"SIRK1 phosphorylation",86a,23820729,"MaxQuant Score",59.1250000,0.9090000,,,,0.86799997091293,1.7160000
EGLTTQEGEDR,ph,T,35,false,"SIRK1 exp - sirk1 mutant vs WT",86b,23820729,,,,0.3359413,,NO,,
EGLTTQEGEDR,ph,T,35,false,"SIRK1 exp - 35S:SIRK1 vs WT",86c,23820729,,,,0.4831819,,NO,,
VLRDGKWSEQEAAILVPGDIVSIK,ub,K,139,false,"Ubiquitination Membrane Proteins",120,33585938,,,,,,,,
DGKWSEQEAAILVPGDIVSIK,ub,K,139,false,"Ubiquitination Membrane Proteins",120,33585938,,,,,,,,
DGKWSEQEAAILVPGDIVSIK,ub,K,139,false,"upl3 mutant / wildtype",168,35926874,"MaxQuant score",177.3200000,1.0000000,1.0172093,0.5236600,NO,4.2568900346099E-37,-1.0706000
LLEGDPLKVDQSALTGESLPVTK,ub,K,175,false,"Ubiquitination Membrane Proteins",120,33585938,,,,,,,,
LLEGDPLKVDQSALTGESLPVTK,ub,K,175,false,"upl3 mutant / wildtype",168,35926874,"MaxQuant score",150.1400000,1.0000000,1.1096949,0.0328840,YES,3.455900032084E-25,-0.5688900
HPGQEVFSGSTCK,sno,C,202,false,"Site-specific nitrosomeproteomic id - gsnor1-3",90a,25699590,XCorr,2.0105643,,,,,0.00070330000016838,-3.8952615
HPGQEVFSGSTCK,sno,C,202,false,"hot5-4 / wildtype, FAT-switch S-nitrosoproteome",169,37277371,,,,0.3706155,0.0396725,NO,,
LSQQGAITKR,ac,K,312,false,"Quantitative Acetylproteomics",101,29440448,,,,,,,,
LSQQGAITKR,ub,K,312,false,"Ubiquitination Membrane Proteins",120,33585938,,,,,,,,
MTAIEEMAGMDVLCSDK,ph,T,315,false,"Brassinosteroid-Regulated Phosphorylation Dynamics",94,26187819,"MaxQuant Score",58.9140000,1.0000000,,,,0.01799999922514,-0.0650000
MTAIEEMAGMDVLCSDK,ph,S,328,false,"Phosphorylation in N starvation",63,22060019,"MASCOT Score",99.0000000,,,,,,-1.1356600
MTAIEEMAGMDVLCSDK,ph,S,328,false,"Brassinosteroid-Regulated Phosphorylation Dynamics",94,26187819,"MaxQuant Score",58.9140000,1.0000000,,,,0.01799999922514,-0.0650000
RMTAIEEMAGMDVLCSDKTGTLTLNK,ub,K,330,false,"Arabidopsis ubiquitination by TUBEs",2,23667124,,,,,,,,
TGTLTLNK,ph,T,335,false,"Tissue atlas Arabidopsis - ProteomicsDB",114,32188942,"MaxQuant score",123.4200000,0.9975070,,,,0.0081411302089691,
TGTLTLNKLSVDK,ub,K,338,false,"Ubiquitination Membrane Proteins",120,33585938,,,,,,,,
TGTLTLNKLSVDK,ub,K,338,false,"upl3 mutant / wildtype",168,35926874,"MaxQuant score",171.7300000,1.0000000,-0.3400754,0.4685600,NO,1.1702800428657E-16,-1.0035000
LSVDKNLVEVFCK,cr,K,343,false,"Open search Plant PTM Viewer 2.0 - Crotonylation",164c,TBA,,,,,,,,
LSVDKNLVEVFCK,ub,K,343,false,"Ubiquitination Membrane Proteins",120,33585938,,,,,,,,
LSVDKNLVEVFCK,ub,K,343,false,"upl3 mutant / wildtype",168,35926874,"MaxQuant score",128.9500000,1.0000000,0.7407117,0.0413370,YES,6.952460012144E-7,0.5412000
NLVEVFCK,sno,C,350,false,"hot5-4 / wildtype, FAT-switch S-nitrosoproteome",169,37277371,,,,0.4763779,0.0159811,NO,,
LSVDKNLVEVFCKGVEK,ub,K,351,false,"Ubiquitination Membrane Proteins",120,33585938,,,,,,,,
NLVEVFCKGVEK,ub,K,351,false,"Ubiquitination Membrane Proteins",120,33585938,,,,,,,,
NLVEVFCKGVEK,ub,K,351,false,"upl3 mutant / wildtype",168,35926874,"MaxQuant score",140.4500000,1.0000000,1.2732175,0.1227200,NO,5.6333298026345E-9,0.2646300
VENQDAIDAAMVGMLADPKEAR,ub,K,386,false,"Ubiquitination Membrane Proteins",120,33585938,,,,,,,,
VENQDAIDAAMVGMLADPKEAR,ub,K,386,false,"upl3 mutant / wildtype",168,35926874,"MaxQuant score",106.6300000,1.0000000,0.6906406,0.4766800,NO,2.0703499678532E-11,-1.4646000
EVHFLPFNPVDKR,ac,K,405,false,"Histone deacetylases - apicidin vs control",98a,29061669,"MaxQuant Score",84.4000000,1.0000000,0.0460000,0.7709035,NO,0.00093999999808148,
EVHFLPFNPVDKR,ac,K,405,false,"Quantitative Acetylproteomics",101,29440448,,,,,,,,
EVHFLPFNPVDKR,ub,K,405,false,"upl3 mutant / wildtype",168,35926874,"MaxQuant score",77.2790000,1.0000000,0.1269729,0.7713800,NO,0.00012278200301807,1.2508000
ASNDLSKK,ac,K,441,true,"Quantitative Acetylproteomics",101,29440448,,,,,,,,
KVLSIIDKYAER,ub,K,442,true,"Ubiquitination Membrane Proteins",120,33585938,,,,,,,,
KVLSIIDK,ub,K,442,true,"Ubiquitination Membrane Proteins",120,33585938,,,,,,,,
KVLSIIDKYAER,ub,K,449,true,"Ubiquitination Membrane Proteins",120,33585938,,,,,,,,
VLSIIDKYAER,ub,K,449,true,"Ubiquitination Membrane Proteins",120,33585938,,,,,,,,
VLSIIDKYAER,ub,K,449,true,"upl3 mutant / wildtype",168,35926874,"MaxQuant score",103.9100000,1.0000000,0.3149865,,,0.00046650800504722,-0.9895100
MITGDQLAIGK,ph,T,511,false,"Phosphorylation Early Elicitor Signaling",23,17317660,,,,,,,,
LGMGTNMYPSSALLGTHK,ph,T,529,true,"Tissue atlas Arabidopsis - ProteomicsDB",114,32188942,"MaxQuant score",123.4200000,1.0000000,,,,4.9234999622205E-14,
LGMGTNMYPSSALLGTHK,ph,S,535,true,"Tissue atlas Arabidopsis - ProteomicsDB",114,32188942,"MaxQuant score",121.3000000,0.8488810,,,,3.2976700255032E-14,
LGMGTNMYPSSALLGTHK,ph,T,540,true,"Tissue atlas Arabidopsis - ProteomicsDB",114,32188942,"MaxQuant score",92.4280000,0.9999790,,,,1.9447899830993E-5,
DANLASIPVEELIEK,ph,S,548,true,"Tissue atlas Arabidopsis - ProteomicsDB",114,32188942,"MaxQuant score",78.0780000,1.0000000,,,,0.00029225499019958,
ADGFAGVFPEHKYEIVKK,ac,K,569,false,"Quantitative Acetylproteomics",101,29440448,,,,,,,,
ADGFAGVFPEHKYEIVK,ac,K,569,false,"Histone deacetylases substrates - hda14 vs WT",98e,29061669,"MaxQuant Score",46.2000000,1.0000000,-0.4210000,0.8375293,NO,0.00098000001162291,
ADGFAGVFPEHKYEIVK,ac,K,569,false,"Quantitative Acetylproteomics",101,29440448,,,,,,,,
HIVGMTGDGVNDAPALKK,ac,K,597,false,"Quantitative Acetylproteomics",101,29440448,,,,,,,,
TAFTMKK,ac,K,863,true,"Quantitative Acetylproteomics",101,29440448,,,,,,,,
TLHGLQPKEAVNIFPEKGSYR,nt,T,881,true,"Arabidopsis translation initiation landscape - NT",167b,35069635,,,,,,,,
EEREAQWALAQRTLHGLQPK,ph,T,881,true,"TOR Kinase and ABA Receptor",100,29290610,XCorr,4.8094473,1.0000000,,,,0.00099450000561774,
EAQWALAQRTLHGLQPK,ph,T,881,true,"Ethylene-regulated phosphorylation ein2 mutant",30,19253305,"MASCOT Score",33.3333000,,,,,,5.9648920
EAQWALAQRTLHGLQPK,ph,T,881,true,"Phosphoproteome ethylene-regulated time response",46,24043427,"MASCOT Score",53.7600000,,,,,,-4.3538000
EAQWALAQRTLHGLQPK,ph,T,881,true,"Chloroplast kinase substrates",60,19376835,"MASCOT Score",34.9100000,,,,,,-0.8318790
EAQWALAQRTLHGLQPK,ph,T,881,true,"TOR Kinase and ABA Receptor",100,29290610,XCorr,3.4900451,1.0000000,,,,6.6489999881014E-5,
TLHGLQPK,ph,T,881,false,"Arabidopsis root NAA phosphoproteome",18a,27643528,"MaxQuant Score",54.5390000,1.0000000,,,,0.0020000000949949,-0.6290000
TLHGLQPK,ph,T,881,false,"Phosphorylation Early Elicitor Signaling",23,17317660,,,,,,,,
TLHGLQPK,ph,T,881,false,"Sucrose-induced phosphorylation",24,17586839,,,,,,,,
TLHGLQPK,ph,T,881,false,"Plasmembrane Ph Immune Responses",25,17651370,,,,,,,,
TLHGLQPK,ph,T,881,false,"Phosphoproteome ethylene-regulated time response",46,24043427,"MASCOT Score",49.4600000,,,,,,1.8147000
TLHGLQPK,ph,T,881,false,"Phosphorylation in N starvation",63,22060019,"MASCOT Score",34.0000000,,,,,,-1.6556100
TLHGLQPK,ph,T,881,false,"srk2dei ABA signaling phopshoproteomics",83,23572148,"MASCOT Score",32.0000000,,,,,,0.0005000
TLHGLQPK,ph,T,881,false,"atm and atr DNA damage response",88,25561503,"MASCOT Score",30.0000000,1.0000000,,,,,-2.1400000
TLHGLQPK,ph,T,881,false,"Lateral root-induction - NAA vs control",106,23328941,"MASCOT Score",21.0000000,,,,,,
TLHGLQPK,ph,T,881,false,"Phospho cell culture sucrose/TOR",109,30833711,,,1.0000000,,,,,
TLHGLQPK,ph,T,881,false,"Tissue atlas Arabidopsis - ProteomicsDB",114,32188942,"MaxQuant score",224.8000000,1.0000000,,,,0,
TLHGLQPKEAVNIFPEKGSYR,ub,K,888,true,"Ubiquitination Membrane Proteins",120,33585938,,,,,,,,
TLHGLQPKEAVNIFPEK,ub,K,888,true,"Ubiquitination Membrane Proteins",120,33585938,,,,,,,,
TLHGLQPKEAVNIFPEK,ub,K,888,true,"upl3 mutant / wildtype",168,35926874,"MaxQuant score",69.1880000,1.0000000,-0.5437195,,,7.0370901084971E-5,0.6414500
EAVNIFPEKGSYR,ub,K,897,true,"Ubiquitination Membrane Proteins",120,33585938,,,,,,,,
EAVNIFPEKGSYRELSEIAEQAK,ph,S,899,true,"Arabidopsis root NAA phosphoproteome",18a,27643528,"MaxQuant Score",80.0200000,0.9220000,,,,2.6489999527257E-8,0.4260000
GSYRELSEIAEQAK,ph,S,899,false,"Tyrosine phosphorylation in Arabidopsis",59,18463617,"MASCOT Score",36.0000000,,,,,,-2.4100066
GSYRELSEIAEQAK,ph,S,899,false,"Brassinosteroid-Regulated Phosphorylation Dynamics",94,26187819,"MaxQuant Score",86.4530000,0.9850000,,,,0.017000000923872,-3.1700000
EAVNIFPEKGSYR,ph,S,899,true,"Plasmamembrane phosphorylation",20,15308754,,,,,,,,
EAVNIFPEKGSYR,ph,S,899,true,"Plasmembrane Ph Immune Responses",25,17651370,,,,,,,,
EAVNIFPEKGSYR,ph,S,899,true,"atm and atr DNA damage response",88,25561503,"MASCOT Score",58.0000000,0.9560000,,,,,-1.1800000
EAVNIFPEKGSYR,ph,S,899,true,"Phosphorylation tonoplast membrane fraction",107,18686298,"MASCOT Score",48.0000000,,,,,,
EAVNIFPEKGSYR,ph,S,899,true,"Phospho cell culture sucrose/TOR",109,30833711,,,0.9961490,,,,,
EAVNIFPEKGSYR,ph,S,899,true,"Tissue atlas Arabidopsis - ProteomicsDB",114,32188942,"MaxQuant score",251.9100000,1.0000000,,,,0,
GSYRELSEIAEQAK,ph,Y,900,false,"Tyrosine phosphorylation in Arabidopsis",59,18463617,"MASCOT Score",32.0000000,,,,,,-0.0602500
GSYRELSEIAEQAK,ph,Y,900,false,"srk2dei ABA signaling phopshoproteomics",83,23572148,"MASCOT Score",38.0000000,,,,,,0.0000000
ELSEIAEQAKR,nt,E,902,false,"Metacaspase9 substrates - Col-0 / mc9",51a,23964026,"MASCOT Score",79.0000000,,2.5510219,,NO,,-1.4780613
ELSEIAEQAKR,nt,E,902,false,"Metacaspase9 substrates - 35S:MC9 / mc9",51b,23964026,"MASCOT Score",64.0000000,,1.8580621,,NO,,-0.6370545
GSYRELSEIAEQAK,ph,S,904,false,"TOR Kinase and ABA Receptor",100,29290610,XCorr,3.8963094,0.9988000,,,,0.0010560000082478,
ELSEIAEQAK,ph,S,904,false,"Plasmamembrane phosphorylation",20,15308754,,,,,,,,
ELSEIAEQAK,ph,S,904,false,"Phosphorylation Early Elicitor Signaling",23,17317660,,,,,,,,
ELSEIAEQAK,ph,S,904,false,"atm and atr DNA damage response",88,25561503,"MASCOT Score",58.0000000,1.0000000,,,,,-1.5600000
ELSEIAEQAK,ph,S,904,false,"Tissue atlas Arabidopsis - ProteomicsDB",114,32188942,"MaxQuant score",218.3600000,1.0000000,,,,4.9754300849605E-27,
ELSEIAEQAKR,ac,K,911,false,"Quantitative Acetylproteomics",101,29440448,,,,,,,,
GSYRELSEIAEQAKR,ub,K,911,false,"Ubiquitination Membrane Proteins",120,33585938,,,,,,,,
ELSEIAEQAKR,ub,K,911,false,"Arabidopsis ubiquitination COFRADIC",40,26744219,"MaxQuant Score",188.9900000,1.0000000,,,,0,0.3180000
ELSEIAEQAKR,ub,K,911,false,"Ubiquitination Membrane Proteins",120,33585938,,,,,,,,
ELSEIAEQAKR,ub,K,911,false,"upl3 mutant / wildtype",168,35926874,"MaxQuant score",157.3800000,1.0000000,-0.3510744,0.4761600,NO,1.5190000368648E-9,0.3089400
LRELHTLK,ph,T,924,false,"TOR Kinase and ABA Receptor",100,29290610,XCorr,2.9754255,1.0000000,,,,0.013799999840558,
LRELHTLK,ph,T,924,false,"Tissue atlas Arabidopsis - ProteomicsDB",114,32188942,"MaxQuant score",96.7450000,1.0000000,,,,8.6063802882563E-5,
ELHTLKGHVESVVK,ub,K,926,false,"Ubiquitination Membrane Proteins",120,33585938,,,,,,,,
ELHTLKGHVESVVK,ub,K,926,false,"upl3 mutant / wildtype",168,35926874,"MaxQuant score",62.0880000,1.0000000,1.6229304,0.0344570,YES,0.00052185298409313,0.4810500
GHVESVVK,ph,S,931,false,"Pollen phosphoproteome Arabidopsis",43,22631563,"MASCOT Score",44.3900000,,,,,,-0.4803930
GHVESVVK,ph,S,931,false,"atm and atr DNA damage response",88,25561503,"MASCOT Score",35.0000000,1.0000000,,,,,-3.1400000
GHVESVVK,ph,S,931,false,"TOR Kinase and ABA Receptor",100,29290610,XCorr,2.6575863,1.0000000,,,,0.074850000441074,
GHVESVVK,ph,S,931,false,"Tissue atlas Arabidopsis - ProteomicsDB",114,32188942,"MaxQuant score",169.9300000,1.0000000,,,,0.00052241201046854,
GHVESVVKLK,ac,K,934,false,"Quantitative Acetylproteomics",101,29440448,,,,,,,,
GHVESVVKLK,ub,K,934,false,"Ubiquitination Membrane Proteins",120,33585938,,,,,,,,
GHVESVVKLK,ub,K,934,false,"upl3 mutant / wildtype",168,35926874,"MaxQuant score",159.8300000,1.0000000,0.6415460,0.4615400,NO,3.9782198655303E-6,-0.4116900
LKGLDIETPSHYTV,ub,K,936,true,"Ubiquitination Membrane Proteins",120,33585938,,,,,,,,
LKGLDIETPSHYTV,ub,K,936,true,"upl3 mutant / wildtype",168,35926874,"MaxQuant score",179.8300000,1.0000000,0.2642362,,,5.8862901342188E-19,0.8079300
GLDIETPSHYTV,ph,T,942,true,"atm and atr DNA damage response",88,25561503,"MASCOT Score",26.0000000,0.9960000,,,,,-1.0800000
GLDIETPSHYTV,ph,T,942,true,"Lateral root-induction - NAA vs control",106,23328941,"MASCOT Score",29.0000000,,,,,,
GLDIETPSHYTV,ph,T,942,true,"Tissue atlas Arabidopsis - ProteomicsDB",114,32188942,"MaxQuant score",296.4200000,0.9998760,,,,0,
GLDIETPSHYTV,ph,S,944,true,"SIRK1 phosphorylation",86a,23820729,"MaxQuant Score",120.1400000,0.9010000,,,,0.01799999922514,7.3100000
GLDIETPSHYTV,ph,S,944,true,"Tissue atlas Arabidopsis - ProteomicsDB",114,32188942,"MaxQuant score",291.2400000,0.9999640,,,,0,
GLDIETPSHYTV,ph,Y,946,true,"Lateral root-induction - NAA vs control",106,23328941,"MASCOT Score",36.0000000,,,,,,
LKGLDIETPSHYTV,ph,T,947,true,"Plasmamembrane phosphorylation",20,15308754,,,,,,,,
LKGLDIETPSHYTV,ph,T,947,true,"Phosphorylation Early Elicitor Signaling",23,17317660,,,,,,,,
LKGLDIETPSHYTV,ph,T,947,true,"STN8 phosphoproteome",38,21768351,"MASCOT Score",53.5900000,,,,,,-0.7064830
LKGLDIETPSHYTV,ph,T,947,true,"MAPK Arabidopsis substrates",45,23172892,"MaxQuant Score",140.1000000,,,,,,
LKGLDIETPSHYTV,ph,T,947,true,"Phosphoproteome ethylene-regulated time response",46,24043427,"MASCOT Score",71.2900000,,,,,,-3.7688000
LKGLDIETPSHYTV,ph,T,947,true,"Chloroplast kinase substrates",60,19376835,"MASCOT Score",42.0300000,,,,,,-0.7064830
LKGLDIETPSHYTV,ph,T,947,true,"BSK8 and BSL2 regulating sucrose-ph synthase",66,24924143,"MaxQuant Score",188.4800000,,,,,,-0.1044300
LKGLDIETPSHYTV,ph,T,947,true,"SnRK2 protein kinase substrates",85,23776212,XCorr,3.5542369,0.9990000,,,,1.4759199704815E-15,
LKGLDIETPSHYTV,ph,T,947,true,"Tissue atlas Arabidopsis - ProteomicsDB",114,32188942,"MaxQuant score",336.9500000,1.0000000,,,,0,
GLDIETPSHYTV,ph,T,947,true,"Arabidopsis root NAA phosphoproteome",18a,27643528,"MaxQuant Score",151.6600000,1.0000000,,,,1.0030000163752E-9,-0.0130000
GLDIETPSHYTV,ph,T,947,true,"Plasmamembrane phosphorylation",20,15308754,,,,,,,,
GLDIETPSHYTV,ph,T,947,true,"Phosphorylation Early Elicitor Signaling",23,17317660,,,,,,,,
GLDIETPSHYTV,ph,T,947,true,"Sucrose-induced phosphorylation",24,17586839,,,,,,,,
GLDIETPSHYTV,ph,T,947,true,"Plasmembrane Ph Immune Responses",25,17651370,,,,,,,,
GLDIETPSHYTV,ph,T,947,true,"Phosphorylation nuclei-enriched fractions",28,19245862,,,,,,,,
GLDIETPSHYTV,ph,T,947,true,"Phytohormone-responsive phosphoproteins",34,20374526,"MASCOT Score",41.0000000,,,,,,0.9801760
GLDIETPSHYTV,ph,T,947,true,"STN8 phosphoproteome",38,21768351,"MASCOT Score",49.8200000,,,,,,-0.9594800
GLDIETPSHYTV,ph,T,947,true,"Phosphoproteome ethylene-regulated time response",46,24043427,"MASCOT Score",34.0500000,,,,,,7.8754000
GLDIETPSHYTV,ph,T,947,true,"Tyrosine phosphorylation in Arabidopsis",59,18463617,"MASCOT Score",40.0000000,,,,,,-0.8506984
GLDIETPSHYTV,ph,T,947,true,"Chloroplast kinase substrates",60,19376835,"MASCOT Score",42.9300000,,,,,,-0.7471090
GLDIETPSHYTV,ph,T,947,true,"srk2dei ABA signaling phopshoproteomics",83,23572148,"MASCOT Score",46.0000000,,,,,,0.0011000
GLDIETPSHYTV,ph,T,947,true,"LAXIC - ABA stress",84a,23660473,XCorr,3.6000000,0.9970000,,,,0.069479398429394,
GLDIETPSHYTV,ph,T,947,true,"SnRK2 protein kinase substrates",85,23776212,XCorr,2.6977935,0.9960000,,,,6.7954902078782E-6,
GLDIETPSHYTV,ph,T,947,true,"SIRK1 phosphorylation",86a,23820729,"MaxQuant Score",151.2800000,0.9980000,,,,0.0010000000474975,8.4690000
GLDIETPSHYTV,ph,T,947,true,"SIRK1 exp - sirk1 mutant vs WT",86b,23820729,,,,-0.8375455,,NO,,
GLDIETPSHYTV,ph,T,947,true,"SIRK1 exp - 35S:SIRK1 vs WT",86c,23820729,,,,-1.3621238,,NO,,
GLDIETPSHYTV,ph,T,947,true,"atm and atr DNA damage response",88,25561503,"MASCOT Score",48.0000000,0.9470000,,,,,0.4100000
GLDIETPSHYTV,ph,T,947,true,"Brassinosteroid-Regulated Phosphorylation Dynamics",94,26187819,"MaxQuant Score",201.0400000,1.0000000,,,,1.6150000241639E-24,-0.4660000
GLDIETPSHYTV,ph,T,947,true,"Lateral root-induction - NAA vs control",106,23328941,"MASCOT Score",55.0000000,,,,,,
GLDIETPSHYTV,ph,T,947,true,"Phospho cell culture sucrose/TOR",109,30833711,,,0.9998620,,,,,
GLDIETPSHYTV,ph,T,947,true,"Col-0 callus - FC Col-0 vs. Col-0 Xray",111a,31410901,,42.8500000,,0.0706356,0.0000000,NO,,0.2197629
GLDIETPSHYTV,ph,T,947,true,"Col-0 X-ray callus - FC Col-0 vs. Col-0 Xray",111b,31410901,,42.8500000,,0.0706356,0.0000000,NO,,0.2197629
GLDIETPSHYTV,ph,T,947,true,"atm callus - FC atm vs. atm Xray",111c,31410901,,42.8500000,,0.0710840,0.0000000,NO,,0.2197629
GLDIETPSHYTV,ph,T,947,true,"atm-3 X-ray callus - FC atm vs. atm Xray",111d,31410901,,42.8500000,,0.0710840,0.0000000,NO,,0.2197629
GLDIETPSHYTV,ph,T,947,true,"Touch-induced phosphorylation: 40s touch vs untouc",136,30291188,"MASCOT score",61.5100000,,-0.0113954,0.8371599,NO,,5.3946708
