Peptide,PTM,ModifiedAA,ModifiedPosition,PeptideUniqueToGene,ExperimentDesc,ExpID,PubmedID,ScoreType,IdentScore,LocProb,Log2FChange,PQ-val,QuantSig,PEP,MassErrorPPM
TGFYQNSCPNVE,nt,T,29,true,"Arg/N-end rule seed, prt6 vs. Wt",99,29168982,"MASCOT Score",34.3100000,,-0.8648198,0.1062771,NO,0.0038610000628978,-0.4989913
TGFYQNSCPNVETIVR,sno,C,36,true,"hot5-4 / wildtype, FAT-switch S-nitrosoproteome",169,37277371,,,,-0.0037866,0.8896414,NO,,
SCPNVETIVR,sno,C,36,false,"hot5-4 / wildtype, FAT-switch S-nitrosoproteome",169,37277371,,,,-0.3359149,0.0833823,NO,,
QKFQQTFVTAPATLR,ac,K,50,false,"Quantitative Acetylproteomics",101,29440448,,,,,,,,
GCDASIMIASPSER,sno,C,74,true,"hot5-4 / wildtype, FAT-switch S-nitrosoproteome",169,37277371,,,,-0.4448111,0.1561563,NO,,
DHPDDMSLAGDGFDTVVKAK,ac,K,104,true,"Quantitative Acetylproteomics",101,29440448,,,,,,,,
VSCADILALATR,sno,C,121,false,"hot5-4 / wildtype, FAT-switch S-nitrosoproteome",169,37277371,,,,,,,,
DILALATR,nt,D,123,false,"Arg/N-end rule seed, prt6 vs. Wt",99,29168982,"MASCOT Score",40.9700000,,-0.9307781,0.0036571,NO,0.11309999972582,0.1631753
QMCPIGVDVR,sno,C,232,true,"hot5-4 / wildtype, FAT-switch S-nitrosoproteome",169,37277371,,,,0.1455222,0.5012358,NO,,
TFDNAYFKNLQQGK,ac,K,258,true,"Quantitative Acetylproteomics",101,29440448,,,,,,,,
