Peptide,PTM,ModifiedAA,ModifiedPosition,PeptideUniqueToGene,ExperimentDesc,ExpID,PubmedID,ScoreType,IdentScore,LocProb,Log2FChange,PQ-val,QuantSig,PEP,MassErrorPPM
DVRNSPDLSIDNPLSQNPDSTWGR,ph,S,73,true,"TOR Kinase and ABA Receptor",100,29290610,XCorr,5.3764515,0.9996000,,,,2.405000032013E-6,
NSPDLSIDNPLSQNPDSTWGR,ph,S,73,true,"Tissue atlas Arabidopsis - ProteomicsDB",114,32188942,"MaxQuant score",170.6800000,0.9999880,,,,0,
FDGLSFEER,ph,S,184,true,"Tissue atlas Arabidopsis - ProteomicsDB",114,32188942,"MaxQuant score",70.4880000,1.0000000,,,,0.0091636199504137,
TNSFPSGSTSPK,ph,S,461,true,"Tissue atlas Arabidopsis - ProteomicsDB",114,32188942,"MaxQuant score",84.3520000,0.9893740,,,,0.00067214702721685,
TNSFPSGSTSPK,ph,S,464,true,"Lateral root-induction - NAA vs control",106,23328941,"MASCOT Score",38.0000000,,,,,,
TNSFPSGSTSPK,ph,S,466,true,"TOR Kinase and ABA Receptor",100,29290610,XCorr,3.2881413,0.8906000,,,,0.002066999906674,
AAEEEKKSPSPIQK,ph,S,498,true,"Tissue atlas Arabidopsis - ProteomicsDB",114,32188942,"MaxQuant score",166.4700000,1.0000000,,,,5.3445200815213E-16,
AAEEEKKSPSPIQK,ph,S,500,true,"Tissue atlas Arabidopsis - ProteomicsDB",114,32188942,"MaxQuant score",105.8900000,1.0000000,,,,6.035880142008E-5,
KSPSPIQK,ph,S,500,true,"atm and atr DNA damage response",88,25561503,"MASCOT Score",25.0000000,1.0000000,,,,,-4.7700000
AESEPTHSAK,ph,S,519,true,"Tissue atlas Arabidopsis - ProteomicsDB",114,32188942,"MaxQuant score",58.8290000,0.9993450,,,,0.015653299167752,
AESEPTHSAKSPNGK,ph,S,527,true,"atm and atr DNA damage response",88,25561503,"MASCOT Score",36.0000000,1.0000000,,,,,-1.6700000
