Peptide,PTM,ModifiedAA,ModifiedPosition,PeptideUniqueToGene,ExperimentDesc,ExpID,PubmedID,ScoreType,IdentScore,LocProb,Log2FChange,PQ-val,QuantSig,PEP,MassErrorPPM
DAVLQEQGSEDEDWGPNDRR,ph,S,398,true,"Tissue atlas Arabidopsis - ProteomicsDB",114,32188942,"MaxQuant score",282.6200000,1.0000000,,,,0,
DAVLQEQGSEDEDWGPNDR,ph,S,398,true,"Phospho cell culture sucrose/TOR",109,30833711,,,1.0000000,,,,,
DQDVVETLEQSER,ph,S,441,true,"Tissue atlas Arabidopsis - ProteomicsDB",114,32188942,"MaxQuant score",262.4200000,1.0000000,,,,0,
DSVSVENK,ph,S,447,true,"atm and atr DNA damage response",88,25561503,"MASCOT Score",46.0000000,1.0000000,,,,,-1.4100000
QSSEISLK,ph,S,611,true,"atm and atr DNA damage response",88,25561503,"MASCOT Score",23.0000000,1.0000000,,,,,-1.8000000
QSSEISLK,ph,S,614,true,"atm and atr DNA damage response",88,25561503,"MASCOT Score",23.0000000,1.0000000,,,,,-1.8000000
EPHEELSSEMSLK,ph,S,637,true,"atm and atr DNA damage response",88,25561503,"MASCOT Score",36.0000000,0.9980000,,,,,-1.6500000
EPHEELSSEMSLK,ph,S,637,true,"Tissue atlas Arabidopsis - ProteomicsDB",114,32188942,"MaxQuant score",144.4300000,0.8629130,,,,2.05662001318E-10,
MIEEPHEELSR,ph,S,664,true,"Tissue atlas Arabidopsis - ProteomicsDB",114,32188942,"MaxQuant score",155.4200000,1.0000000,,,,1.9413100293963E-10,
