Peptide,PTM,ModifiedAA,ModifiedPosition,PeptideUniqueToGene,ExperimentDesc,ExpID,PubmedID,ScoreType,IdentScore,LocProb,Log2FChange,PQ-val,QuantSig,PEP,MassErrorPPM
TKNSNHDENEFISFEPNQNTKIR,nt,T,2,true,"Arg/N-end rule pathway Roots",80,25728785,"MASCOT Score",39.1000000,,,,,0.010259999893606,
TKNSNHDENEFISFEPNQNTKIR,nt,T,2,true,"HUNTER N-terminome: legumain, GluC and trypsin",119,31951383,"MaxQuant score",96.7180000,,,,,,
TKNSNHDENEFISFEPNQNTKIR,nt,T,2,true,"Arabidopsis translation initiation landscape - NT",167b,35069635,,,,,,,,
TKNSNHDENEFISFEPNQNTK,ph,T,2,true,"Tissue atlas Arabidopsis - ProteomicsDB",114,32188942,"MaxQuant score",433.8400000,0.9183420,,,,0,
TKNSNHDENEFISFEPNQNTK,ph,S,5,true,"PAMP-triggered phosphorylation",48,24601666,"MASCOT Score",30.4400000,,,,,,
TKNSNHDENEFISFEPNQNTK,ph,S,5,true,"Col-0 callus - FC Col-0 vs. Col-0 Xray",111a,31410901,,25.1300000,,1.2658746,0.0312136,YES,,1.3582193
TKNSNHDENEFISFEPNQNTK,ph,S,5,true,"Col-0 X-ray callus - FC Col-0 vs. Col-0 Xray",111b,31410901,,25.1300000,,1.2658746,0.0312136,YES,,1.3582193
TKNSNHDENEFISFEPNQNTK,ph,S,5,true,"atm callus - FC atm vs. atm Xray",111c,31410901,,25.1300000,,-1.5438475,0.0299134,YES,,1.3582193
TKNSNHDENEFISFEPNQNTK,ph,S,5,true,"atm-3 X-ray callus - FC atm vs. atm Xray",111d,31410901,,25.1300000,,-1.5438475,0.0299134,YES,,1.3582193
NSNHDENEFISFEPNQNTK,ph,S,5,true,"Arabidopsis root NAA phosphoproteome",18a,27643528,"MaxQuant Score",41.9110000,0.9990000,,,,0.0010000000474975,0.5050000
NSNHDENEFISFEPNQNTK,ph,S,5,true,"TOR Kinase and ABA Receptor",100,29290610,XCorr,4.5298629,1.0000000,,,,0.00043479999294505,
NSNHDENEFISFEPNQNTK,ph,S,5,true,"Phospho cell culture sucrose/TOR",109,30833711,,,1.0000000,,,,,
NSNHDENEFISFEPNQNTK,ph,S,5,true,"Tissue atlas Arabidopsis - ProteomicsDB",114,32188942,"MaxQuant score",241.8400000,0.9999930,,,,0,
SYSHFGIHEE,nt,S,75,false,"Arabidopsis translation initiation landscape - NT",167b,35069635,,,,,,,,
AGAAHVYAVECSQMADMAK,sno,C,138,true,"hot5-4 / wildtype, FAT-switch S-nitrosoproteome",169,37277371,,,,,,,,
LLKTMDISK,ac,K,272,false,"Quantitative Acetylproteomics",101,29440448,,,,,,,,
LSYSLNGQHCK,ox,C,379,true,"SPEAR - 10 mM H2O2 / mock",138a,34619326,,,,1.9471322,0.0421993,YES,,
LSYSLNGQHCK,so,C,379,true,"Arabidopsis S-sulfenylation chemoproteomics",108,31578252,"pFind PSM Score",0.0028176,,,,,,-1.4156985
TQHYKMR,nt,T,384,true,"Arabidopsis translation initiation landscape - NT",167b,35069635,,,,,,,,
