Peptide,PTM,ModifiedAA,ModifiedPosition,PeptideUniqueToGene,ExperimentDesc,ExpID,PubmedID,ScoreType,IdentScore,LocProb,Log2FChange,PQ-val,QuantSig,PEP,MassErrorPPM
ASKLIQVQSKACE,nt,A,2,true,"Arg/N-end rule seed, prt6 vs. Wt",99,29168982,"MASCOT Score",30.6500000,,,,,4.7000001359265E-5,-1.1270424
ASKLIQVQ,nt,A,2,true,"Arg/N-end rule seed, prt6 vs. Wt",99,29168982,"MASCOT Score",40.4800000,,,,,0.21439999341965,1.2443419
ASKLIQVQSKACEASKF,nta,A,2,true,"Arg/N-end rule pathway Roots",80,25728785,"MASCOT Score",77.6400000,,,,,6.7650000801223E-7,
ASKLIQVQSKACE,nta,A,2,true,"Arg/N-end rule seed, prt6 vs. Wt",99,29168982,"MASCOT Score",30.6500000,,0.3079778,0.0799071,NO,4.7000001359265E-5,-1.1270424
ASKLIQVQSKACE,nta,A,2,true,"HUNTER N-terminome: legumain, GluC and trypsin",119,31951383,"MaxQuant score",51.8410000,,,,,,
ASKLIQVQSKACE,nta,A,2,true,"Arabidopsis translation initiation landscape - NTA",167a,35069635,,,,,,,,
ASKLIQVQ,nta,A,2,true,"Arg/N-end rule seed, prt6 vs. Wt",99,29168982,"MASCOT Score",40.4800000,,-0.2250927,0.2356379,NO,0.21439999341965,1.2443419
ACEASK,sno,C,13,false,"hot5-4 / wildtype, FAT-switch S-nitrosoproteome",169,37277371,,,,1.1507615,0.0006516,YES,,
FVAKHGTSYYR,ac,K,21,true,"Quantitative Acetylproteomics",101,29440448,,,,,,,,
QLLEKNK,ac,K,33,true,"Quantitative Acetylproteomics",101,29440448,,,,,,,,
QYIQEPATVEKCQELSK,so,C,47,true,"Arabidopsis S-sulfenylation chemoproteomics",108,31578252,"pFind PSM Score",0.0493157,,1.0020600,,,,0.3486148
EVDYAKNLWK,ac,K,77,true,"Quantitative Acetylproteomics",101,29440448,,,,,,,,
