Peptide,PTM,ModifiedAA,ModifiedPosition,PeptideUniqueToGene,ExperimentDesc,ExpID,PubmedID,ScoreType,IdentScore,LocProb,Log2FChange,PQ-val,QuantSig,PEP,MassErrorPPM
MKKVLHR,nta,M,1,true,"Arabidopsis translation initiation landscape - NTA",167a,35069635,,,,,,,,
DHNPGHGDTSPFETK,ph,T,288,true,"Tissue atlas Arabidopsis - ProteomicsDB",114,32188942,"MaxQuant score",130.6700000,0.9567450,,,,9.5607094863226E-7,
DHNPGHGDTSPFETK,ph,S,289,true,"Tissue atlas Arabidopsis - ProteomicsDB",114,32188942,"MaxQuant score",175.7700000,0.9274950,,,,5.6737698572659E-19,
NSSSYENLR,ph,S,342,true,"atm and atr DNA damage response",88,25561503,"MASCOT Score",36.0000000,1.0000000,,,,,0.9100000
TSSSNMQGGGFGK,ph,S,357,true,"Tissue atlas Arabidopsis - ProteomicsDB",114,32188942,"MaxQuant score",124.8900000,0.9993970,,,,6.5622400143184E-5,
TVDELSENTSWR,ph,T,401,true,"Tissue atlas Arabidopsis - ProteomicsDB",114,32188942,"MaxQuant score",173.7200000,0.8529500,,,,1.4853600256238E-14,
TVDELSENTSWR,ph,S,402,true,"Tissue atlas Arabidopsis - ProteomicsDB",114,32188942,"MaxQuant score",182.7200000,0.9354410,,,,8.4623801376094E-20,
GHSRENSLEMRPNDSFAK,ph,S,408,true,"Phospho cell culture sucrose/TOR",109,30833711,,,1.0000000,,,,,
GHSRENSLEMRPNDSFAK,ph,S,412,true,"TOR Kinase and ABA Receptor",100,29290610,XCorr,3.1115100,0.9379000,,,,0.0090089999139309,
ENSLEMRPNDSFAK,ph,S,412,true,"Phospho cell culture sucrose/TOR",109,30833711,,,1.0000000,,,,,
ENSLEMRPNDSFAK,ph,S,412,true,"Tissue atlas Arabidopsis - ProteomicsDB",114,32188942,"MaxQuant score",252.2500000,1.0000000,,,,0,
ENSLEMRPNDSFAK,ph,S,420,true,"Tissue atlas Arabidopsis - ProteomicsDB",114,32188942,"MaxQuant score",53.9810000,1.0000000,,,,0.0056760399602354,
ASSHSPSSNFSDDNDVTALDHIDSPSIFEENK,ph,S,463,true,"TOR Kinase and ABA Receptor",100,29290610,XCorr,5.2785115,0.9980000,,,,1.3250000563403E-7,
ASSHSPSSNFSDDNDVTALDHIDSPSIFEENK,ph,S,463,true,"Tissue atlas Arabidopsis - ProteomicsDB",114,32188942,"MaxQuant score",133.7100000,0.9996930,,,,0,
DLGKLSSASTSQVLEK,ph,S,567,true,"Tissue atlas Arabidopsis - ProteomicsDB",114,32188942,"MaxQuant score",166.3800000,0.9225600,,,,9.3022798153032E-19,
LSSASTSQVLEK,ph,S,568,true,"Tissue atlas Arabidopsis - ProteomicsDB",114,32188942,"MaxQuant score",80.8150000,0.9902470,,,,0.0010219200048596,
LSSASTSQVLEK,ph,S,572,true,"Tissue atlas Arabidopsis - ProteomicsDB",114,32188942,"MaxQuant score",163.3300000,0.9358200,,,,2.8028898646504E-10,
EKPSSPPTFDDGPTSPPASLHEPEPSAK,ph,S,581,true,"Tissue atlas Arabidopsis - ProteomicsDB",114,32188942,"MaxQuant score",91.4370000,0.7514640,,,,7.5005100998591E-16,
EKPSSPPTFDDGPTSPPASLHEPEPSAK,ph,S,582,true,"Tissue atlas Arabidopsis - ProteomicsDB",114,32188942,"MaxQuant score",223.4700000,0.9906480,,,,0,
EKPSSPPTFDDGPTSPPASLHEPEPSAK,ph,T,585,true,"PAMP-triggered phosphorylation",48,24601666,"MASCOT Score",30.8700000,,,,,,
EKPSSPPTFDDGPTSPPASLHEPEPSAK,ph,T,585,true,"srk2dei ABA signaling phopshoproteomics",83,23572148,"MASCOT Score",40.0000000,,,,,,-0.0007000
EKPSSPPTFDDGPTSPPASLHEPEPSAK,ph,T,591,true,"PAMP-triggered phosphorylation",48,24601666,"MASCOT Score",30.8700000,,,,,,
EKPSSPPTFDDGPTSPPASLHEPEPSAK,ph,T,591,true,"srk2dei ABA signaling phopshoproteomics",83,23572148,"MASCOT Score",26.0000000,,,,,,-0.0008000
EKPSSPPTFDDGPTSPPASLHEPEPSAK,ph,S,592,true,"Large-scale phosphorylation discovery",44,23111157,XCorr,3.5920000,,,,,,
EKPSSPPTFDDGPTSPPASLHEPEPSAK,ph,S,592,true,"TOR Kinase and ABA Receptor",100,29290610,XCorr,3.7113354,0.8183000,,,,0.003622000105679,
EKPSSPPTFDDGPTSPPASLHEPEPSAK,ph,S,592,true,"Phospho cell culture sucrose/TOR",109,30833711,,,0.9168330,,,,,
EKPSSPPTFDDGPTSPPASLHEPEPSAK,ph,S,592,true,"Tissue atlas Arabidopsis - ProteomicsDB",114,32188942,"MaxQuant score",235.4200000,0.9917080,,,,0,
FDDYDRDSESEEDNLGR,ph,Y,609,true,"LAXIC - mannitol vs control",84b,23660473,XCorr,2.6100000,0.8540000,,,,1.7999999499807E-6,
FDDYDRDSESEEDNLGR,ph,S,613,true,"STN8 phosphoproteome",38,21768351,"MASCOT Score",54.0000000,,,,,,
FDDYDRDSESEEDNLGR,ph,S,613,true,"srk2dei ABA signaling phopshoproteomics",83,23572148,"MASCOT Score",52.0000000,,,,,,0.0013000
FDDYDRDSESEEDNLGR,ph,S,613,true,"LAXIC - mannitol vs control",84b,23660473,XCorr,2.8900000,0.9770000,,,,0.028707200661302,
FDDYDRDSESEEDNLGR,ph,S,613,true,"SnRK2 protein kinase substrates",85,23776212,XCorr,3.8402853,0.9960000,,,,1.0590599577864E-12,
FDDYDRDSESEEDNLGR,ph,S,613,true,"atm and atr DNA damage response",88,25561503,"MASCOT Score",64.0000000,1.0000000,,,,,-0.4200000
FDDYDRDSESEEDNLGR,ph,S,613,true,"TOR Kinase and ABA Receptor",100,29290610,XCorr,4.7175794,0.9931000,,,,0.0010679999832064,
FDDYDRDSESEEDNLGR,ph,S,613,true,"Col-0 callus - FC Col-0 vs. Col-0 Xray",111a,31410901,,45.9000000,,1.0428058,0.0236316,YES,,1.5233673
FDDYDRDSESEEDNLGR,ph,S,613,true,"Col-0 X-ray callus - FC Col-0 vs. Col-0 Xray",111b,31410901,,45.9000000,,1.0428058,0.0236316,YES,,1.5233673
FDDYDRDSESEEDNLGR,ph,S,613,true,"atm callus - FC atm vs. atm Xray",111c,31410901,,45.9000000,,0.7359605,0.3148221,NO,,1.5233673
FDDYDRDSESEEDNLGR,ph,S,613,true,"atm-3 X-ray callus - FC atm vs. atm Xray",111d,31410901,,45.9000000,,0.7359605,0.3148221,NO,,1.5233673
DSESEEDNLGR,ph,S,613,true,"Tissue atlas Arabidopsis - ProteomicsDB",114,32188942,"MaxQuant score",154.6500000,1.0000000,,,,6.0031699041127E-30,
FDDYDRDSESEEDNLGR,ph,S,615,true,"Tyrosine phosphorylation in Arabidopsis",59,18463617,"MASCOT Score",45.0000000,,,,,,-1.5882044
FDDYDRDSESEEDNLGR,ph,S,615,true,"Conserved plant phosphoproteome - Arabidopsis",61a,20466843,"MASCOT Score",52.0000000,1.0000000,,,,,
FDDYDRDSESEEDNLGR,ph,S,615,true,"srk2dei ABA signaling phopshoproteomics",83,23572148,"MASCOT Score",52.0000000,,,,,,0.0013000
FDDYDRDSESEEDNLGR,ph,S,615,true,"LAXIC - ABA stress",84a,23660473,XCorr,3.0800000,0.8970000,,,,0.012274100445211,
FDDYDRDSESEEDNLGR,ph,S,615,true,"LAXIC - mannitol vs control",84b,23660473,XCorr,2.8900000,0.9990000,,,,0.028707200661302,
FDDYDRDSESEEDNLGR,ph,S,615,true,"SnRK2 protein kinase substrates",85,23776212,XCorr,2.3023753,0.9960000,,,,0.065550602972507,
FDDYDRDSESEEDNLGR,ph,S,615,true,"atm and atr DNA damage response",88,25561503,"MASCOT Score",64.0000000,1.0000000,,,,,-0.4200000
FDDYDRDSESEEDNLGR,ph,S,615,true,"TOR Kinase and ABA Receptor",100,29290610,XCorr,4.5176187,1.0000000,,,,1.1570000424399E-5,
FDDYDRDSESEEDNLGR,ph,S,615,true,"Col-0 callus - FC Col-0 vs. Col-0 Xray",111a,31410901,,45.9000000,,1.0428058,0.0236316,YES,,1.5233673
FDDYDRDSESEEDNLGR,ph,S,615,true,"Col-0 X-ray callus - FC Col-0 vs. Col-0 Xray",111b,31410901,,45.9000000,,1.0428058,0.0236316,YES,,1.5233673
FDDYDRDSESEEDNLGR,ph,S,615,true,"atm callus - FC atm vs. atm Xray",111c,31410901,,45.9000000,,0.7359605,0.3148221,NO,,1.5233673
FDDYDRDSESEEDNLGR,ph,S,615,true,"atm-3 X-ray callus - FC atm vs. atm Xray",111d,31410901,,45.9000000,,0.7359605,0.3148221,NO,,1.5233673
DSESEEDNLGR,ph,S,615,true,"Tissue atlas Arabidopsis - ProteomicsDB",114,32188942,"MaxQuant score",80.9800000,1.0000000,,,,2.2449499738286E-5,
LTAQKSHMSEGPDDLGR,ph,S,638,true,"atm and atr DNA damage response",88,25561503,"MASCOT Score",39.0000000,1.0000000,,,,,-0.4200000
SHMSEGPDDLGR,ph,S,638,true,"srk2dei ABA signaling phopshoproteomics",83,23572148,"MASCOT Score",47.0000000,,,,,,-0.0004000
SHMSEGPDDLGR,ph,S,638,true,"atm and atr DNA damage response",88,25561503,"MASCOT Score",49.0000000,0.9980000,,,,,0.1700000
SHMSEGPDDLGR,ph,S,638,true,"TOR Kinase and ABA Receptor",100,29290610,XCorr,3.2729845,1.0000000,,,,0.00038559999666177,
SHMSEGPDDLGR,ph,S,638,true,"Phospho cell culture sucrose/TOR",109,30833711,,,0.9999980,,,,,
SHMSEGPDDLGR,ph,S,638,true,"Tissue atlas Arabidopsis - ProteomicsDB",114,32188942,"MaxQuant score",188.9600000,1.0000000,,,,2.1866899155816E-21,
LTAQKSHMSEGPDDLGR,ph,S,641,true,"Large-scale phosphorylation discovery",44,23111157,XCorr,3.5790000,,,,,,
LTAQKSHMSEGPDDLGR,ph,S,641,true,"atm and atr DNA damage response",88,25561503,"MASCOT Score",33.0000000,1.0000000,,,,,0.1300000
SHMSEGPDDLGR,ph,S,641,true,"Tissue atlas Arabidopsis - ProteomicsDB",114,32188942,"MaxQuant score",118.5400000,1.0000000,,,,1.4434899942017E-9,
YFFPSDTEDQGDDSKTQEESDAETPTGLK,ph,Y,650,true,"PAMP-triggered phosphorylation",48,24601666,"MASCOT Score",28.0700000,,,,,,
YFFPSDTEDQGDDSKTQEESDAETPTGLK,ph,S,654,true,"PAMP-triggered phosphorylation",48,24601666,"MASCOT Score",20.5200000,,,,,,
YFFPSDTEDQGDDSKTQEESDAETPTGLK,ph,S,654,true,"Col-0 callus - FC Col-0 vs. Col-0 Xray",111a,31410901,,31.5200000,,2.0121561,0.0106945,YES,,1.5081159
YFFPSDTEDQGDDSKTQEESDAETPTGLK,ph,S,654,true,"Col-0 X-ray callus - FC Col-0 vs. Col-0 Xray",111b,31410901,,31.5200000,,2.0121561,0.0106945,YES,,1.5081159
YFFPSDTEDQGDDSKTQEESDAETPTGLK,ph,S,654,true,"atm callus - FC atm vs. atm Xray",111c,31410901,,31.5200000,,2.5306553,0.0271820,YES,,1.5081159
YFFPSDTEDQGDDSKTQEESDAETPTGLK,ph,S,654,true,"atm-3 X-ray callus - FC atm vs. atm Xray",111d,31410901,,31.5200000,,2.5306553,0.0271820,YES,,1.5081159
YFFPSDTEDQGDDSK,ph,S,654,true,"STN8 phosphoproteome",38,21768351,"MASCOT Score",54.0300000,,,,,,-2.1195700
YFFPSDTEDQGDDSK,ph,S,654,true,"Tyrosine phosphorylation in Arabidopsis",59,18463617,"MASCOT Score",49.0000000,,,,,,-1.0930964
YFFPSDTEDQGDDSK,ph,S,654,true,"Conserved plant phosphoproteome - Arabidopsis",61a,20466843,"MASCOT Score",49.0000000,1.0000000,,,,,
YFFPSDTEDQGDDSK,ph,S,654,true,"srk2dei ABA signaling phopshoproteomics",83,23572148,"MASCOT Score",70.0000000,,,,,,-0.0013000
YFFPSDTEDQGDDSK,ph,S,654,true,"LAXIC - ABA stress",84a,23660473,XCorr,4.1800000,0.9950000,,,,0.0025773299857974,
YFFPSDTEDQGDDSK,ph,S,654,true,"LAXIC - mannitol vs control",84b,23660473,XCorr,3.8300000,1.0000000,,,,0.0013263099826872,
YFFPSDTEDQGDDSK,ph,S,654,true,"SnRK2 protein kinase substrates",85,23776212,XCorr,3.2734563,1.0000000,,,,9.5350796702753E-11,
YFFPSDTEDQGDDSK,ph,S,654,true,"atm and atr DNA damage response",88,25561503,"MASCOT Score",57.0000000,0.9970000,,,,,0.8400000
YFFPSDTEDQGDDSK,ph,S,654,true,"TOR Kinase and ABA Receptor",100,29290610,XCorr,3.9559245,0.9995000,,,,0.00026870000874624,
YFFPSDTEDQGDDSK,ph,S,654,true,"Phospho cell culture sucrose/TOR",109,30833711,,,0.9584820,,,,,
YFFPSDTEDQGDDSK,ph,S,654,true,"Tissue atlas Arabidopsis - ProteomicsDB",114,32188942,"MaxQuant score",209.8700000,0.9999920,,,,1.4012984643248E-45,
YFFPSDTEDQGDDSKTQEESDAETPTGLK,ph,T,656,true,"SnRK2 protein kinase substrates",85,23776212,XCorr,3.5631669,0.8320000,,,,0.0075022201053798,
YFFPSDTEDQGDDSK,ph,T,656,true,"srk2dei ABA signaling phopshoproteomics",83,23572148,"MASCOT Score",32.0000000,,,,,,0.0003000
YFFPSDTEDQGDDSK,ph,T,656,true,"Tissue atlas Arabidopsis - ProteomicsDB",114,32188942,"MaxQuant score",91.2070000,0.9999900,,,,5.70593001612E-5,
YFFPSDTEDQGDDSKTQEESDAETPTGLK,ph,T,665,true,"PAMP-triggered phosphorylation",48,24601666,"MASCOT Score",28.0700000,,,,,,
YFFPSDTEDQGDDSKTQEESDAETPTGLK,ph,T,665,true,"SnRK2 protein kinase substrates",85,23776212,XCorr,3.9193068,0.8030000,,,,4.4600899855141E-5,
YFFPSDTEDQGDDSKTQEESDAETPTGLK,ph,S,669,true,"PAMP-triggered phosphorylation",48,24601666,"MASCOT Score",21.2700000,,,,,,
TQEESDAETPTGLK,ph,S,669,true,"STN8 phosphoproteome",38,21768351,"MASCOT Score",53.1300000,,,,,,-1.0697800
TQEESDAETPTGLK,ph,S,669,true,"Tyrosine phosphorylation in Arabidopsis",59,18463617,"MASCOT Score",48.0000000,,,,,,-0.9465788
TQEESDAETPTGLK,ph,S,669,true,"Conserved plant phosphoproteome - Arabidopsis",61a,20466843,"MASCOT Score",61.0000000,1.0000000,,,,,
TQEESDAETPTGLK,ph,S,669,true,"srk2dei ABA signaling phopshoproteomics",83,23572148,"MASCOT Score",60.0000000,,,,,,-0.0006000
TQEESDAETPTGLK,ph,S,669,true,"LAXIC - mannitol vs control",84b,23660473,XCorr,4.8500000,1.0000000,,,,0.0028890699613839,
TQEESDAETPTGLK,ph,S,669,true,"SnRK2 protein kinase substrates",85,23776212,XCorr,4.0878854,1.0000000,,,,0.011343199759722,
TQEESDAETPTGLK,ph,S,669,true,"atm and atr DNA damage response",88,25561503,"MASCOT Score",70.0000000,1.0000000,,,,,-0.9000000
TQEESDAETPTGLK,ph,S,669,true,"TOR Kinase and ABA Receptor",100,29290610,XCorr,4.7289548,1.0000000,,,,4.3320000031599E-7,
TQEESDAETPTGLK,ph,S,669,true,"Phospho cell culture sucrose/TOR",109,30833711,,,0.9999310,,,,,
TQEESDAETPTGLK,ph,S,669,true,"Tissue atlas Arabidopsis - ProteomicsDB",114,32188942,"MaxQuant score",315.4700000,1.0000000,,,,0,
TQEESDAETPTGLK,ph,T,673,true,"LAXIC - mannitol vs control",84b,23660473,XCorr,3.6900000,0.9740000,,,,0.010535799898207,
TQEESDAETPTGLK,ph,T,673,true,"atm and atr DNA damage response",88,25561503,"MASCOT Score",56.0000000,1.0000000,,,,,0.9600000
TQEESDAETPTGLK,ph,T,673,true,"Tissue atlas Arabidopsis - ProteomicsDB",114,32188942,"MaxQuant score",278.2400000,0.9997090,,,,0,
YFFPSDTEDQGDDSKTQEESDAETPTGLK,ph,T,675,true,"PAMP-triggered phosphorylation",48,24601666,"MASCOT Score",20.5200000,,,,,,
FGPLASGLENETTLPSYGSSPPRDK,ph,S,697,true,"Large-scale phosphorylation discovery",44,23111157,XCorr,4.4070000,,,,,,
FGPLASGLENETTLPSYGSSPPRDK,ph,S,697,true,"Col-0 callus - FC Col-0 vs. Col-0 Xray",111a,31410901,,34.2200000,,0.6499101,0.0000000,NO,,0.7956446
FGPLASGLENETTLPSYGSSPPRDK,ph,S,697,true,"Col-0 X-ray callus - FC Col-0 vs. Col-0 Xray",111b,31410901,,34.2200000,,0.6499101,0.0000000,NO,,0.7956446
FGPLASGLENETTLPSYGSSPPRDK,ph,S,697,true,"atm callus - FC atm vs. atm Xray",111c,31410901,,34.2200000,,1.0459727,0.0000000,NO,,0.7956446
FGPLASGLENETTLPSYGSSPPRDK,ph,S,697,true,"atm-3 X-ray callus - FC atm vs. atm Xray",111d,31410901,,34.2200000,,1.0459727,0.0000000,NO,,0.7956446
FGPLASGLENETTLPSYGSSPPRDK,ph,S,698,true,"srk2dei ABA signaling phopshoproteomics",83,23572148,"MASCOT Score",95.0000000,,,,,,-0.0013000
FGPLASGLENETTLPSYGSSPPR,ph,S,698,true,"Large-scale phosphorylation discovery",44,23111157,XCorr,5.8910000,,,,,,
FGPLASGLENETTLPSYGSSPPR,ph,S,698,true,"LAXIC - ABA stress",84a,23660473,XCorr,3.5400000,0.8830000,,,,2.4399999798419E-9,
FGPLASGLENETTLPSYGSSPPR,ph,S,698,true,"SnRK2 protein kinase substrates",85,23776212,XCorr,2.8880396,0.9570000,,,,5.1893698582717E-6,
FGPLASGLENETTLPSYGSSPPR,ph,S,698,true,"Tissue atlas Arabidopsis - ProteomicsDB",114,32188942,"MaxQuant score",478.1400000,0.9710670,,,,0,
SIKEYLPTEVDPSR,ph,S,708,true,"Tissue atlas Arabidopsis - ProteomicsDB",114,32188942,"MaxQuant score",61.7320000,0.9998810,,,,0.0057877898216248,
NELYTQKASNSDKR,ub,K,741,true,"Arabidopsis ubiquitination COFRADIC",40,26744219,"MaxQuant Score",58.8850000,0.9990000,,,,6.528999801958E-5,-0.1580000
TRPTHLHSGVSHK,ph,S,791,true,"Tissue atlas Arabidopsis - ProteomicsDB",114,32188942,"MaxQuant score",125.4500000,0.9770680,,,,2.1691999791074E-5,
TTPASASASYFHTMSSDDEDEK,ph,Y,827,true,"srk2dei ABA signaling phopshoproteomics",83,23572148,"MASCOT Score",32.0000000,,,,,,-0.0004000
TTPASASASYFHTMSSDDEDEK,ph,T,830,true,"srk2dei ABA signaling phopshoproteomics",83,23572148,"MASCOT Score",32.0000000,,,,,,-0.0004000
TTPASASASYFHTMSSDDEDEKEVHR,ph,S,832,true,"atm and atr DNA damage response",88,25561503,"MASCOT Score",36.0000000,1.0000000,,,,,0.0700000
TTPASASASYFHTMSSDDEDEK,ph,S,832,true,"srk2dei ABA signaling phopshoproteomics",83,23572148,"MASCOT Score",23.0000000,,,,,,0.0000000
TTPASASASYFHTMSSDDEDEK,ph,S,832,true,"Brassinosteroid-Regulated Phosphorylation Dynamics",94,26187819,"MaxQuant Score",75.2150000,0.9730000,,,,0.0070000002160668,2.0100000
TTPASASASYFHTMSSDDEDEK,ph,S,832,true,"TOR Kinase and ABA Receptor",100,29290610,XCorr,4.6525774,0.9600000,,,,0.0012100000167266,
TTPASASASYFHTMSSDDEDEKEVHR,ph,S,833,true,"atm and atr DNA damage response",88,25561503,"MASCOT Score",36.0000000,1.0000000,,,,,0.0700000
TTPASASASYFHTMSSDDEDEK,ph,S,833,true,"srk2dei ABA signaling phopshoproteomics",83,23572148,"MASCOT Score",21.0000000,,,,,,-0.0017000
TTPASASASYFHTMSSDDEDEK,ph,S,833,true,"Brassinosteroid-Regulated Phosphorylation Dynamics",94,26187819,"MaxQuant Score",75.2150000,0.9730000,,,,0.0070000002160668,2.0100000
TTPASASASYFHTMSSDDEDEK,ph,S,833,true,"TOR Kinase and ABA Receptor",100,29290610,XCorr,4.6525774,0.9905000,,,,0.0012100000167266,
PYISISR,ph,S,855,true,"Tissue atlas Arabidopsis - ProteomicsDB",114,32188942,"MaxQuant score",91.6400000,0.9930300,,,,2.1094299881952E-5,
RPSLVTAK,ph,S,868,true,"atm and atr DNA damage response",88,25561503,"MASCOT Score",35.0000000,1.0000000,,,,,-1.8800000
RPSLVTAK,ph,S,868,true,"Tissue atlas Arabidopsis - ProteomicsDB",114,32188942,"MaxQuant score",103.2100000,0.9959770,,,,0.0034866800997406,
VSFDEESPPKLSPEAKPLTK,ph,S,883,true,"Phospho cell culture sucrose/TOR",109,30833711,,,0.9982390,,,,,
VSFDEESPPKLSPEAKPLTK,ph,S,883,true,"Tissue atlas Arabidopsis - ProteomicsDB",114,32188942,"MaxQuant score",152.8800000,1.0000000,,,,4.05467011105E-25,
VSFDEESPPKLSPEAK,ph,S,883,true,"atm and atr DNA damage response",88,25561503,"MASCOT Score",43.0000000,1.0000000,,,,,-0.9900000
VSFDEESPPK,ph,S,883,true,"Tyrosine phosphorylation in Arabidopsis",59,18463617,"MASCOT Score",49.0000000,,,,,,-0.9064769
VSFDEESPPK,ph,S,883,true,"Conserved plant phosphoproteome - Arabidopsis",61a,20466843,"MASCOT Score",49.0000000,1.0000000,,,,,
VSFDEESPPK,ph,S,883,true,"TOR Kinase and ABA Receptor",100,29290610,XCorr,3.5507491,1.0000000,,,,0.00019589999283198,
IDKVSFDEESPPKLSPEAKPLTK,ph,S,888,true,"STN8 phosphoproteome",38,21768351,"MASCOT Score",57.9800000,,,,,,-0.9128610
IDKVSFDEESPPKLSPEAKPLTK,ph,S,888,true,"Chloroplast kinase substrates",60,19376835,"MASCOT Score",44.1900000,,,,,,-0.3367430
VSFDEESPPKLSPEAK,ph,S,888,true,"atm and atr DNA damage response",88,25561503,"MASCOT Score",43.0000000,1.0000000,,,,,-0.9900000
VSFDEESPPKLSPEAK,ph,S,888,true,"Tissue atlas Arabidopsis - ProteomicsDB",114,32188942,"MaxQuant score",156.4700000,0.9999880,,,,4.05467011105E-25,
LSPEAKPLTK,ph,S,888,true,"Phospho cell culture sucrose/TOR",109,30833711,,,0.9999980,,,,,
QQGSASSLSFLPK,ph,S,936,true,"Tissue atlas Arabidopsis - ProteomicsDB",114,32188942,"MaxQuant score",113.7000000,0.9999070,,,,0.00010399999882793,
TNKASPDQDSPPK,ph,S,950,true,"Tissue atlas Arabidopsis - ProteomicsDB",114,32188942,"MaxQuant score",115.6300000,0.9999820,,,,0.00016517100448254,
ASPDQDSPPKLVPK,ph,S,955,true,"Tissue atlas Arabidopsis - ProteomicsDB",114,32188942,"MaxQuant score",193.4300000,1.0000000,,,,3.0391799885425E-31,
ASPDQDSPPK,ph,S,955,true,"atm and atr DNA damage response",88,25561503,"MASCOT Score",47.0000000,1.0000000,,,,,0.1500000
QRGSASSLSFLPK,ph,S,972,true,"Tissue atlas Arabidopsis - ProteomicsDB",114,32188942,"MaxQuant score",107.1100000,0.9986600,,,,0.00028821898740716,
TDKASPDQDSPPK,ph,S,986,true,"atm and atr DNA damage response",88,25561503,"MASCOT Score",39.0000000,1.0000000,,,,,-3.3400000
TDKASPDQDSPPK,ph,S,986,true,"Tissue atlas Arabidopsis - ProteomicsDB",114,32188942,"MaxQuant score",103.1600000,0.9998890,,,,0.00035433599259704,
TDKASPDQDSPPKLLPK,ph,S,991,true,"STN8 phosphoproteome",38,21768351,"MASCOT Score",44.6200000,,,,,,-0.4356100
ASPDQDSPPKLLPK,ph,S,991,true,"atm and atr DNA damage response",88,25561503,"MASCOT Score",30.0000000,1.0000000,,,,,-0.0100000
ASPDQDSPPKLLPK,ph,S,991,true,"Tissue atlas Arabidopsis - ProteomicsDB",114,32188942,"MaxQuant score",185.7400000,1.0000000,,,,9.5190696851541E-23,
ASPDQDSPPK,ph,S,991,true,"atm and atr DNA damage response",88,25561503,"MASCOT Score",47.0000000,1.0000000,,,,,0.1500000
QQGSATSSSSLPK,ph,S,1008,true,"Tissue atlas Arabidopsis - ProteomicsDB",114,32188942,"MaxQuant score",108.9700000,0.9312820,,,,0.00014082000416238,
QEGLASSSSSLPK,ph,S,1050,true,"Tissue atlas Arabidopsis - ProteomicsDB",114,32188942,"MaxQuant score",179.4600000,0.9076350,,,,1.0221599672392E-21,
TVTSPDPETPAKEK,ph,S,1057,true,"Chloroplast kinase substrates",60,19376835,"MASCOT Score",36.1400000,,,,,,-0.7410380
TVTSPDPETPAK,ph,S,1057,true,"Chloroplast kinase substrates",60,19376835,"MASCOT Score",49.7100000,,,,,,1.1579200
TVTSPDPETPAK,ph,S,1057,true,"LAXIC - ABA stress",84a,23660473,XCorr,2.5500000,0.9890000,,,,0.025725400075316,
TVTSPDPETPAK,ph,S,1057,true,"SnRK2 protein kinase substrates",85,23776212,XCorr,2.6834693,0.9980000,,,,0.006735370028764,
TVTSPDPETPAK,ph,S,1057,true,"TOR Kinase and ABA Receptor",100,29290610,XCorr,2.8355770,0.9938000,,,,0.004594000056386,
TVTSPDPETPAK,ph,S,1057,true,"Tissue atlas Arabidopsis - ProteomicsDB",114,32188942,"MaxQuant score",144.4100000,0.9991940,,,,3.2678901334293E-5,
TVTSPDPETPAKEK,ph,T,1062,true,"Large-scale phosphorylation discovery",44,23111157,XCorr,4.0470000,,,,,,
TVTSPDPETPAKEK,ph,T,1062,true,"Tissue atlas Arabidopsis - ProteomicsDB",114,32188942,"MaxQuant score",144.4100000,1.0000000,,,,8.0143901868723E-5,
