Peptide,PTM,ModifiedAA,ModifiedPosition,PeptideUniqueToGene,ExperimentDesc,ExpID,PubmedID,ScoreType,IdentScore,LocProb,Log2FChange,PQ-val,QuantSig,PEP,MassErrorPPM
SWQSYVDDHLMCEVEGNHLTH,nt,S,2,true,"Stromal N-terminome",96,26371235,"MASCOT Score",44.1000000,,,,,,
SWQSYVDDHLMCEVEGNHLTH,nt,S,2,true,"Arg/N-end rule seed, prt6 vs. Wt",99,29168982,"MASCOT Score",53.4800000,,,,,5.9459998738021E-5,-3.1151439
SWQSYVDDHLMCE,nt,S,2,true,"Arg/N-end rule seed, prt6 vs. Wt",99,29168982,"MASCOT Score",45.9300000,,,,,1.3279999620863E-5,-3.1825240
SWQSYVDDHLMC,nt,S,2,false,"Arg/N-end rule seed, prt6 vs. Wt",99,29168982,"MASCOT Score",33.9100000,,,,,9.9580001915456E-6,0.5296992
SWQSYVDDH,nt,S,2,false,"Arg/N-end rule seed, prt6 vs. Wt",99,29168982,"MASCOT Score",50.5700000,,,,,0.069320000708103,-0.6343860
SWQSYVDDHLMCEVEGNHLTHAAIFGQDGSVW,nta,S,2,true,"Arg/N-end rule pathway Roots",80,25728785,"MASCOT Score",62.6600000,,,,,1.1709999853338E-5,
SWQSYVDDHLMCEVEGNHLTHAAIF,nta,S,2,true,"Arg/N-end rule pathway Roots",80,25728785,"MASCOT Score",60.0300000,,,,,4.6739998538214E-8,
SWQSYVDDHLMCEVEGNHLTHAA,nta,S,2,true,"Arg/N-end rule pathway Roots",80,25728785,"MASCOT Score",41.0000000,,,,,0.00012620000052266,
SWQSYVDDHLMCEVEGNHLTH,nta,S,2,true,"Arg/N-end rule pathway Roots",80,25728785,"MASCOT Score",46.0900000,,,,,1.9170000086888E-5,
SWQSYVDDHLMCEVEGNHLTH,nta,S,2,true,"Stromal N-terminome",96,26371235,"MASCOT Score",44.1000000,,,,,,
SWQSYVDDHLMCEVEGNHLTH,nta,S,2,true,"Arg/N-end rule seed, prt6 vs. Wt",99,29168982,"MASCOT Score",53.4800000,,,,,5.9459998738021E-5,-3.1151439
SWQSYVDDHLMCEVEGN,nta,S,2,true,"HUNTER N-terminome: legumain, GluC and trypsin",119,31951383,"MaxQuant score",169.6200000,,,,,,
SWQSYVDDHLMCE,nta,S,2,true,"Arg/N-end rule seed, prt6 vs. Wt",99,29168982,"MASCOT Score",45.9300000,,,,,1.3279999620863E-5,-3.1825240
SWQSYVDDHLMCE,nta,S,2,true,"HUNTER N-terminome: legumain, GluC and trypsin",119,31951383,"MaxQuant score",221.5000000,,,,,,
SWQSYVDDHLMC,nta,S,2,false,"Arg/N-end rule seed, prt6 vs. Wt",99,29168982,"MASCOT Score",33.9100000,,,,,9.9580001915456E-6,0.5296992
SWQSYVDDH,nta,S,2,false,"Arg/N-end rule seed, prt6 vs. Wt",99,29168982,"MASCOT Score",50.5700000,,,,,0.069320000708103,-0.6343860
SWQSYVDD,nta,S,2,false,"HUNTER N-terminome: legumain, GluC and trypsin",119,31951383,"MaxQuant score",176.0900000,,,,,,
QDGSVWAQSSAFPQLKPAE,nt,Q,28,true,"HUNTER N-terminome: legumain, GluC and trypsin",119,31951383,"MaxQuant score",65.8050000,,,,,,
GLFLGGE,nt,G,64,false,"Arg/N-end rule seed, prt6 vs. Wt",99,29168982,"MASCOT Score",36.5300000,,,,,0.057879999279976,-2.5871116
YMVVQGEAGAVIR,nt,Y,72,true,"N-terminal ChaFRADIC",92,26010716,"MASCOT Score",37.5200000,,,,,3.6389999877429E-5,
GEAGAVIR,nt,G,77,true,"Arg/N-end rule seed, prt6 vs. Wt",99,29168982,"MASCOT Score",39.6900000,,-0.7527234,0.1515741,NO,0.096249997615814,-0.2432432
KGPGGVTIKK,ac,K,95,false,"Quantitative Acetylproteomics",101,29440448,,,,,,,,
GPGGVTIKK,ac,K,95,false,"Quantitative Acetylproteomics",101,29440448,,,,,,,,
LGDYLIESGL,nt,L,122,true,"Arabidopsis translation initiation landscape - NT",167b,35069635,,,,,,,,
