Peptide,PTM,ModifiedAA,ModifiedPosition,PeptideUniqueToGene,ExperimentDesc,ExpID,PubmedID,ScoreType,IdentScore,LocProb,Log2FChange,PQ-val,QuantSig,PEP,MassErrorPPM
AFEEDCATPISK,acy,C,48,true,"Arabidopsis S-acylation atlas - Hypocotyl",163b,35681017,,,,,,,,
QVADAMTVEMHAGLASDGGSKLK,ub,K,77,true,"upl3 mutant / wildtype",168,35926874,"MaxQuant score",122.1800000,1.0000000,-0.3437325,0.2943400,NO,4.1667499512962E-17,-1.5549000
FVATECEDFHLPEGR,acy,C,159,true,"Arabidopsis S-acylation atlas - Meristem",163a,35681017,,,,,,,,
FVATECEDFHLPEGR,sno,C,159,true,"hot5-4 / wildtype, FAT-switch S-nitrosoproteome",169,37277371,,,,0.4616530,0.0218847,NO,,
QTSLSSGSLIK,ph,S,184,true,"Tissue atlas Arabidopsis - ProteomicsDB",114,32188942,"MaxQuant score",97.9570000,0.9931050,,,,9.9258802947588E-5,
QTSLSSGSLIK,ph,S,186,true,"atm and atr DNA damage response",88,25561503,"MASCOT Score",29.0000000,0.9910000,,,,,-0.5100000
QTSLSSGSLIK,ph,S,186,true,"Tissue atlas Arabidopsis - ProteomicsDB",114,32188942,"MaxQuant score",121.5600000,0.8245580,,,,2.1010899217799E-5,
IKDILEVPTTSLKMR,ac,K,390,true,"Quantitative Acetylproteomics",101,29440448,,,,,,,,
DILEVPTTSLKMR,ac,K,390,true,"Quantitative Acetylproteomics",101,29440448,,,,,,,,
