Peptide,PTM,ModifiedAA,ModifiedPosition,PeptideUniqueToGene,ExperimentDesc,ExpID,PubmedID,ScoreType,IdentScore,LocProb,Log2FChange,PQ-val,QuantSig,PEP,MassErrorPPM
QILSSTQR,ph,S,44,true,"Tyrosine phosphorylation in Arabidopsis",59,18463617,"MASCOT Score",22.0000000,,,,,,-1.8784482
ATGTDVVAAVEEQDSTPVVAEDKETVASEKSDAPAPTSQSR,nt,A,74,true,"Stromal N-terminome",96,26371235,"MASCOT Score",54.3500000,,,,,,
ATGTDVVAAVEEQDSTPVVAEDKETVASEKSD,nt,A,74,true,"HUNTER N-terminome: legumain, GluC and trypsin",119,31951383,"MaxQuant score",128.4300000,,,,,,
ATGTDVVAAVEEQDSTPVVAED,nt,A,74,true,"HUNTER N-terminome: legumain, GluC and trypsin",119,31951383,"MaxQuant score",179.8100000,,,,,,
ATGTDVVAAVEEQD,nt,A,74,true,"HUNTER N-terminome: legumain, GluC and trypsin",119,31951383,"MaxQuant score",174.4000000,,,,,,
ATGTDVVAAVEE,nt,A,74,true,"Arg/N-end rule seed, prt6 vs. Wt",99,29168982,"MASCOT Score",54.3700000,,-0.1989516,0.1551766,NO,5.4330001148628E-5,-0.3221586
ATGTDVVAAVEE,nt,A,74,true,"HUNTER N-terminome: legumain, GluC and trypsin",119,31951383,"MaxQuant score",159.5800000,,,,,,
ATGTDVVAAVE,nt,A,74,true,"Arg/N-end rule seed, prt6 vs. Wt",99,29168982,"MASCOT Score",60.3800000,,-0.1838773,0.7895120,NO,3.3290000374109E-6,-1.2656080
TGTDVVAAVEEQDSTPVVAEDKETVASEKSDAPAPTSQSR,nt,T,75,true,"HUNTER N-terminome: legumain, GluC and trypsin",119,31951383,"MaxQuant score",82.6540000,,,,,,
TGTDVVAAVEEQDSTPVVAED,nt,T,75,true,"HUNTER N-terminome: legumain, GluC and trypsin",119,31951383,"MaxQuant score",60.1570000,,,,,,
TGTDVVAAVEE,nt,T,75,true,"Arg/N-end rule seed, prt6 vs. Wt",99,29168982,"MASCOT Score",45.0700000,,-0.1510524,0.2135980,NO,0.000731399981305,-1.5700025
TGTDVVAAVE,nt,T,75,true,"Arg/N-end rule seed, prt6 vs. Wt",99,29168982,"MASCOT Score",63.4300000,,-0.1927814,0.4640182,NO,7.3780000093393E-5,-0.5119972
AVEEQDSTPVVAEDKETVASEKSDAPAPTSQSR,nt,A,82,true,"Stromal N-terminome",96,26371235,"MASCOT Score",37.9500000,,,,,,
AVEEQDSTPVVAEDKETVASEKSDAPAPTSQSR,nt,A,82,true,"HUNTER N-terminome: legumain, GluC and trypsin",119,31951383,"MaxQuant score",192.7300000,,,,,,
AVEEQDSTPVVAEDKETVASEKSD,nt,A,82,true,"HUNTER N-terminome: legumain, GluC and trypsin",119,31951383,"MaxQuant score",82.5930000,,,,,,
AVEEQDSTPVVAED,nt,A,82,true,"HUNTER N-terminome: legumain, GluC and trypsin",119,31951383,"MaxQuant score",149.2300000,,,,,,
ETVASEKSDAPAPTSQSR,nt,E,97,true,"Metacaspase9 substrates - in vitro rMC9",51c,23964026,"MASCOT Score",98.0000000,,,,,,-0.6000087
SEMPAVK,mox,M,125,true,"cat2 Methionine oxidation - 1h stress",62a,25693801,"MASCOT Score",34.0000000,,0.1185238,,NO,,
KSEMPAVKNEELVPGATFTGK,ac,K,129,true,"Quantitative Acetylproteomics",101,29440448,,,,,,,,
LVEADIESKR,ac,K,198,true,"Quantitative Acetylproteomics",101,29440448,,,,,,,,
LVEADIESKR,ub,K,198,true,"Arabidopsis ubiquitination COFRADIC",40,26744219,"MaxQuant Score",113.4400000,1.0000000,,,,5.2360001063789E-6,0.2020000
GQMLDGVVK,mox,M,250,true,"cat2 Methionine oxidation - 1h stress",62a,25693801,"MASCOT Score",53.0000000,,0.0699642,,NO,,
GQMLDGVVK,mox,M,250,true,"cat2 Methionine oxidation - 3h stress",62b,25693801,"MASCOT Score",33.0000000,,-0.1118022,,NO,,
GQMLDGVVKNLTR,ac,K,256,true,"Quantitative Acetylproteomics",101,29440448,,,,,,,,
FRKNEEIAAFLDKR,nt,F,345,true,"Stromal N-terminome",96,26371235,"MASCOT Score",53.2200000,,,,,,
KNEEIAAFLDKR,ac,K,357,true,"Quantitative Acetylproteomics",101,29440448,,,,,,,,
GISPALVKQLR,nt,G,518,true,"Metacaspase9 substrates - in vitro rMC9",51c,23964026,"MASCOT Score",83.0000000,,2.1477992,,NO,,-0.3028437
GISPALVKQLR,ac,K,525,true,"Histone deacetylases substrates - hda14 vs WT",98e,29061669,"MaxQuant Score",50.4000000,1.0000000,1.8820000,0.5357967,NO,0.0070000002160668,
EETGAGMMDCK,sno,C,538,true,"Site-specific nitrosomeproteomic id - gsnor1-3",90a,25699590,XCorr,2.4084795,,,,,0.012459999881685,-6.7838946
EETGAGMMDCK,sno,C,538,true,"Site-specific nitrosomeproteomic id - gsnor1-3",90b,25699590,XCorr,2.3400000,,,,,0.0033249999396503,-7.2400000
NALSESEGDMVK,ph,S,543,true,"Tissue atlas Arabidopsis - ProteomicsDB",114,32188942,"MaxQuant score",89.9590000,0.9985170,,,,0.00012238199997228,
NALSESEGDMVK,mox,M,549,true,"cat2 Methionine oxidation - 1h stress",62a,25693801,"MASCOT Score",85.0000000,,0.0315952,,NO,,
GLASADKKASR,nt,G,560,true,"Metacaspase9 substrates - in vitro rMC9",51c,23964026,"MASCOT Score",75.0000000,,,,,,-0.2285305
CETDFVSR,nt,C,594,true,"Arg/N-end rule seed, prt6 vs. Wt",99,29168982,"MASCOT Score",36.5200000,,0.5295706,0.2470927,NO,0.061000000685453,-0.9557334
ETDFVSR,nt,E,595,true,"Arg/N-end rule seed, prt6 vs. Wt",99,29168982,"MASCOT Score",36.9700000,,-0.5389099,0.0218016,NO,0.22519999742508,0.6076422
EIEMQK,mox,M,643,false,"cat2 Methionine oxidation - 3h stress",62b,25693801,"MASCOT Score",36.0000000,,-0.0552492,,NO,,
EIEMQKEDLLSKPEQIR,ac,K,645,true,"Histone deacetylases substrates - hda14 vs WT",98e,29061669,"MaxQuant Score",48.9000000,0.9870000,1.5900000,0.1836538,NO,0.00047999998787418,
EDLLSKPEQIR,ac,K,651,true,"Histone deacetylases - apicidin vs control",98a,29061669,"MaxQuant Score",196.2000000,1.0000000,-0.2690000,0.1592209,NO,0,
EDLLSKPEQIR,ac,K,651,true,"Histone deacetylases substrates - hda14 vs WT",98e,29061669,"MaxQuant Score",55.3000000,1.0000000,0.3040000,0.4613176,NO,0.003000000026077,
EAVASPPTTVVSAALVKQLR,nt,E,747,true,"Metacaspase9 substrates - in vitro rMC9",51c,23964026,"MASCOT Score",76.0000000,,,,,,-1.4244688
EETGAGMMDCKK,sno,C,776,true,"Site-specific nitrosomeproteomic id - gsnor1-3",90a,25699590,XCorr,3.2508104,,,,,0.0012989999959245,-7.1935757
EETGAGMMDCKK,sno,C,776,true,"Site-specific nitrosomeproteomic id - gsnor1-3",90b,25699590,XCorr,2.6200000,,,,,0.15160000324249,-6.5000000
EETGAGMMDCK,sno,C,776,true,"Site-specific nitrosomeproteomic id - gsnor1-3",90a,25699590,XCorr,2.4084795,,,,,0.012459999881685,-6.7838946
EETGAGMMDCK,sno,C,776,true,"Site-specific nitrosomeproteomic id - gsnor1-3",90b,25699590,XCorr,2.3400000,,,,,0.0033249999396503,-7.2400000
EETGAGMMDCKK,ac,K,777,true,"Histone deacetylases- hda14 vs WT (low light)",98c,29061669,"MaxQuant Score",131.0600000,1.0000000,1.1460000,0.9549926,NO,0.00011999999696855,
ALAATGGDLEKAQEFLR,ac,K,789,true,"Histone deacetylases - apicidin vs control",98a,29061669,"MaxQuant Score",67.6000000,1.0000000,-0.0820000,0.8356030,NO,1.4999999464749E-8,
ALAATGGDLEKAQEFLR,ac,K,789,true,"Histone deacetylases substrates - hda14 vs WT",98e,29061669,"MaxQuant Score",66.8000000,1.0000000,1.8570000,0.0414954,YES,3.0999999580672E-5,
ETDFVGR,nt,E,833,true,"Arg/N-end rule seed, prt6 vs. Wt",99,29168982,"MASCOT Score",30.6600000,,-0.5216592,0.0544811,NO,0.17520000040531,-0.4759226
EIEMQREDLLSKPENIREK,mox,M,881,true,"cat2 Methionine oxidation - 1h stress",62a,25693801,"MASCOT Score",35.0000000,,-0.0372360,,NO,,
EDLLSKPENIR,ph,S,888,true,"Tissue atlas Arabidopsis - ProteomicsDB",114,32188942,"MaxQuant score",63.7090000,1.0000000,,,,0.0017917799996212,
EDLLSKPENIR,ac,K,889,true,"Histone deacetylases - apicidin vs control",98a,29061669,"MaxQuant Score",195.0000000,1.0000000,-0.1160000,0.5533501,NO,0,
EDLLSKPENIR,ac,K,889,true,"Histone deacetylases substrates - TSA vs control",98b,29061669,"MaxQuant Score",195.0000000,1.0000000,0.0810000,0.9977001,NO,0,
EDLLSKPENIR,ac,K,889,true,"Histone deacetylases substrates - hda14 vs WT",98e,29061669,"MaxQuant Score",83.2000000,1.0000000,0.0490000,0.9289664,NO,3.7000001611887E-5,
EDLLSKPENIR,ac,K,889,true,"Quantitative Acetylproteomics",101,29440448,,,,,,,,
DDSVLVKDLVK,ac,K,925,true,"Histone deacetylases - apicidin vs control",98a,29061669,"MaxQuant Score",72.3000000,1.0000000,-0.0680000,0.7063176,NO,0.0020000000949949,
DDSVLVKDLVK,ac,K,925,true,"Histone deacetylases substrates - hda14 vs WT",98e,29061669,"MaxQuant Score",86.8000000,1.0000000,0.1680000,0.8016781,NO,2.3000000510365E-5,
