Peptide,PTM,ModifiedAA,ModifiedPosition,PeptideUniqueToGene,ExperimentDesc,ExpID,PubmedID,ScoreType,IdentScore,LocProb,Log2FChange,PQ-val,QuantSig,PEP,MassErrorPPM
AKKIGVTME,nt,A,2,true,"Arg/N-end rule seed, prt6 vs. Wt",99,29168982,"MASCOT Score",30.6400000,,,,,0.012419999577105,-4.3730788
AKKIGVTMEVGN,nta,A,2,true,"HUNTER N-terminome: legumain, GluC and trypsin",119,31951383,"MaxQuant score",,,,,,,
AKKIGVTMEVGN,nta,A,2,true,"Arabidopsis translation initiation landscape - NTA",167a,35069635,,,,,,,,
AKKIGVTME,nta,A,2,true,"Arg/N-end rule seed, prt6 vs. Wt",99,29168982,"MASCOT Score",30.6400000,,-0.0016298,0.9896228,NO,0.012419999577105,-4.3730788
LVGLAKATDMILLSK,cr,K,159,true,"Open search Plant PTM Viewer 2.0 - Crotonylation",164c,TBA,,,,,,,,
ATDMILLSK,mox,M,163,true,"cat2 Methionine oxidation - 3h stress",62b,25693801,"MASCOT Score",42.0000000,,0.2017866,,NO,,
AILKNSR,ac,K,229,true,"Quantitative Acetylproteomics",101,29440448,,,,,,,,
GIKSVEANMK,ac,K,350,true,"Quantitative Acetylproteomics",101,29440448,,,,,,,,
QNIFKEIEK,ac,K,408,true,"Quantitative Acetylproteomics",101,29440448,,,,,,,,
VPVVVGNCIGFAVNR,so,C,490,true,"Arabidopsis S-sulfenylation chemoproteomics",108,31578252,"pFind PSM Score",0.1584750,,,,,,-0.9339475
SPMTELLLKSGR,ac,K,570,true,"Quantitative Acetylproteomics",101,29440448,,,,,,,,
GSKPKPDPSVLSIVEKSR,ac,K,603,true,"Quantitative Acetylproteomics",101,29440448,,,,,,,,
KLSETYGSFFKPSR,ac,K,696,true,"Quantitative Acetylproteomics",101,29440448,,,,,,,,
AMNGMLLSESKSSR,ac,K,715,true,"Quantitative Acetylproteomics",101,29440448,,,,,,,,
