Peptide,PTM,ModifiedAA,ModifiedPosition,PeptideUniqueToGene,ExperimentDesc,ExpID,PubmedID,ScoreType,IdentScore,LocProb,Log2FChange,PQ-val,QuantSig,PEP,MassErrorPPM
GNNNNNAGSSSENYR,ph,S,32,true,"atm and atr DNA damage response",88,25561503,"MASCOT Score",51.0000000,1.0000000,,,,,0.7500000
GNNNNNAGSSSENYR,ph,S,32,true,"Tissue atlas Arabidopsis - ProteomicsDB",114,32188942,"MaxQuant score",172.0600000,0.7812280,,,,6.2463600971044E-18,
NFLHPTSQRPAEPSSGSQR,ph,S,68,true,"Tissue atlas Arabidopsis - ProteomicsDB",114,32188942,"MaxQuant score",125.1100000,0.7907090,,,,5.1602598164283E-15,
PAEPSSGSQR,ph,S,68,true,"atm and atr DNA damage response",88,25561503,"MASCOT Score",27.0000000,0.8620000,,,,,-0.2000000
SDSGQQPPQNFFNDLSK,ph,S,75,true,"atm and atr DNA damage response",88,25561503,"MASCOT Score",46.0000000,0.9480000,,,,,-0.4600000
SDSGQQPPQNFFNDLSK,ph,S,75,true,"Tissue atlas Arabidopsis - ProteomicsDB",114,32188942,"MaxQuant score",168.5700000,0.8090010,,,,4.6134600172532E-22,
ASHVSTATDEGSTAENEDVAESEVGGGSSSNHAK,ph,S,149,true,"Col-0 callus - FC Col-0 vs. Col-0 Xray",111a,31410901,,37.4200000,,-2.0009370,0.0000000,NO,,1.1944916
ASHVSTATDEGSTAENEDVAESEVGGGSSSNHAK,ph,S,149,true,"Col-0 X-ray callus - FC Col-0 vs. Col-0 Xray",111b,31410901,,37.4200000,,-2.0009370,0.0000000,NO,,1.1944916
ASHVSTATDEGSTAENEDVAESEVGGGSSSNHAK,ph,S,149,true,"atm callus - FC atm vs. atm Xray",111c,31410901,,37.4200000,,-0.3989361,0.0000000,NO,,1.1944916
ASHVSTATDEGSTAENEDVAESEVGGGSSSNHAK,ph,S,149,true,"atm-3 X-ray callus - FC atm vs. atm Xray",111d,31410901,,37.4200000,,-0.3989361,0.0000000,NO,,1.1944916
ASHVSTATDEGSTAENEDVAESEVGGGSSSNHAK,ph,T,150,true,"Col-0 callus - FC Col-0 vs. Col-0 Xray",111a,31410901,,37.4200000,,-2.0009370,0.0000000,NO,,1.1944916
ASHVSTATDEGSTAENEDVAESEVGGGSSSNHAK,ph,T,150,true,"Col-0 X-ray callus - FC Col-0 vs. Col-0 Xray",111b,31410901,,37.4200000,,-2.0009370,0.0000000,NO,,1.1944916
ASHVSTATDEGSTAENEDVAESEVGGGSSSNHAK,ph,T,150,true,"atm callus - FC atm vs. atm Xray",111c,31410901,,37.4200000,,-0.3989361,0.0000000,NO,,1.1944916
ASHVSTATDEGSTAENEDVAESEVGGGSSSNHAK,ph,T,150,true,"atm-3 X-ray callus - FC atm vs. atm Xray",111d,31410901,,37.4200000,,-0.3989361,0.0000000,NO,,1.1944916
ASHVSTATDEGSTAENEDVAESEVGGGSSSNHAK,ph,T,152,true,"Col-0 callus - FC Col-0 vs. Col-0 Xray",111a,31410901,,61.4900000,,-0.3363900,0.0000000,NO,,1.5752008
ASHVSTATDEGSTAENEDVAESEVGGGSSSNHAK,ph,T,152,true,"Col-0 X-ray callus - FC Col-0 vs. Col-0 Xray",111b,31410901,,61.4900000,,-0.3363900,0.0000000,NO,,1.5752008
ASHVSTATDEGSTAENEDVAESEVGGGSSSNHAK,ph,T,152,true,"atm callus - FC atm vs. atm Xray",111c,31410901,,61.4900000,,-2.4094000,0.0000000,NO,,1.5752008
ASHVSTATDEGSTAENEDVAESEVGGGSSSNHAK,ph,T,152,true,"atm-3 X-ray callus - FC atm vs. atm Xray",111d,31410901,,61.4900000,,-2.4094000,0.0000000,NO,,1.5752008
ASHVSTATDEGSTAENEDVAESEVGGGSSSNHAK,ph,T,152,true,"Tissue atlas Arabidopsis - ProteomicsDB",114,32188942,"MaxQuant score",151.2100000,0.9824700,,,,0,
ASHVSTATDEGSTAENEDVAESEVGGGSSSNHAK,ph,S,156,true,"Lateral root-induction - NAA vs control",106,23328941,"MASCOT Score",63.0000000,,,,,,
ASHVSTATDEGSTAENEDVAESEVGGGSSSNHAK,ph,S,156,true,"Col-0 callus - FC Col-0 vs. Col-0 Xray",111a,31410901,,61.4900000,,-0.3363900,0.0000000,NO,,1.5752008
ASHVSTATDEGSTAENEDVAESEVGGGSSSNHAK,ph,S,156,true,"Col-0 X-ray callus - FC Col-0 vs. Col-0 Xray",111b,31410901,,61.4900000,,-0.3363900,0.0000000,NO,,1.5752008
ASHVSTATDEGSTAENEDVAESEVGGGSSSNHAK,ph,S,156,true,"atm callus - FC atm vs. atm Xray",111c,31410901,,61.4900000,,-2.4094000,0.0000000,NO,,1.5752008
ASHVSTATDEGSTAENEDVAESEVGGGSSSNHAK,ph,S,156,true,"atm-3 X-ray callus - FC atm vs. atm Xray",111d,31410901,,61.4900000,,-2.4094000,0.0000000,NO,,1.5752008
ASHVSTATDEGSTAENEDVAESEVGGGSSSNHAK,ph,S,156,true,"Tissue atlas Arabidopsis - ProteomicsDB",114,32188942,"MaxQuant score",287.7600000,0.9916930,,,,0,
ASHVSTATDEGSTAENEDVAESEVGGGSSSNHAK,ph,T,157,true,"Col-0 callus - FC Col-0 vs. Col-0 Xray",111a,31410901,,81.1900000,,-0.7238889,0.0000000,NO,,1.2928415
ASHVSTATDEGSTAENEDVAESEVGGGSSSNHAK,ph,T,157,true,"Col-0 X-ray callus - FC Col-0 vs. Col-0 Xray",111b,31410901,,81.1900000,,-0.7238889,0.0000000,NO,,1.2928415
ASHVSTATDEGSTAENEDVAESEVGGGSSSNHAK,ph,T,157,true,"atm callus - FC atm vs. atm Xray",111c,31410901,,81.1900000,,-0.6227988,0.0000000,NO,,1.2928415
ASHVSTATDEGSTAENEDVAESEVGGGSSSNHAK,ph,T,157,true,"atm-3 X-ray callus - FC atm vs. atm Xray",111d,31410901,,81.1900000,,-0.6227988,0.0000000,NO,,1.2928415
ASHVSTATDEGSTAENEDVAESEVGGGSSSNHAK,ph,S,174,true,"PAMP-triggered phosphorylation",48,24601666,"MASCOT Score",59.5000000,,,,,,
SNHGGSGTEEFTMR,nt,S,199,true,"Arabidopsis translation initiation landscape - NT",167b,35069635,,,,,,,,
DGSGGIVALSQSPFAGR,ph,S,278,true,"srk2dei ABA signaling phopshoproteomics",83,23572148,"MASCOT Score",47.0000000,,,,,,-0.0017000
DGSGGIVALSQSPFAGR,ph,S,278,true,"TOR Kinase and ABA Receptor",100,29290610,XCorr,3.9029508,0.9998000,,,,0.00032349998946302,
DGSGGIVALSQSPFAGR,ph,S,285,true,"Lateral root-induction - NAA vs control",106,23328941,"MASCOT Score",25.0000000,,,,,,
DGSGGIVALSQSPFAGR,ph,S,285,true,"Tissue atlas Arabidopsis - ProteomicsDB",114,32188942,"MaxQuant score",116.1300000,0.8391820,,,,3.8997498563731E-9,
DGSGGIVALSQSPFAGR,ph,S,287,true,"Col-0 callus - FC Col-0 vs. Col-0 Xray",111a,31410901,,73.9400000,,-1.1483718,0.0000000,NO,,0.7270812
DGSGGIVALSQSPFAGR,ph,S,287,true,"Col-0 X-ray callus - FC Col-0 vs. Col-0 Xray",111b,31410901,,73.9400000,,-1.1483718,0.0000000,NO,,0.7270812
DGSGGIVALSQSPFAGR,ph,S,287,true,"atm callus - FC atm vs. atm Xray",111c,31410901,,73.9400000,,-5.0208413,0.0000000,NO,,0.7270812
DGSGGIVALSQSPFAGR,ph,S,287,true,"atm-3 X-ray callus - FC atm vs. atm Xray",111d,31410901,,73.9400000,,-5.0208413,0.0000000,NO,,0.7270812
DGSGGIVALSQSPFAGR,ph,S,287,true,"Tissue atlas Arabidopsis - ProteomicsDB",114,32188942,"MaxQuant score",235.6900000,0.9999910,,,,0,
VPSNSATAKGEGK,ph,S,297,true,"Tissue atlas Arabidopsis - ProteomicsDB",114,32188942,"MaxQuant score",47.5680000,0.7750460,,,,0.0075594899244606,
VPSNSATAK,ph,S,297,true,"atm and atr DNA damage response",88,25561503,"MASCOT Score",28.0000000,0.9980000,,,,,-3.7500000
HASEEYVSPESSMGMTAASAHT,ph,S,411,true,"Large-scale phosphorylation discovery",44,23111157,XCorr,4.6770000,,,,,,
HASEEYVSPESSMGMTAASAHT,ph,S,411,true,"atm and atr DNA damage response",88,25561503,"MASCOT Score",55.0000000,1.0000000,,,,,-0.3300000
HASEEYVSPESSMGMTAASAHT,ph,S,411,true,"Tissue atlas Arabidopsis - ProteomicsDB",114,32188942,"MaxQuant score",404.1700000,0.9999610,,,,0,
HASEEYVSPESSMGMTAASAHT,ph,S,414,true,"Large-scale phosphorylation discovery",44,23111157,XCorr,4.0560000,,,,,,
HASEEYVSPESSMGMTAASAHT,ph,S,415,true,"Tissue atlas Arabidopsis - ProteomicsDB",114,32188942,"MaxQuant score",101.3300000,0.8919330,,,,3.1468699174253E-12,
HASEEYVSPESSMGMTAASAHT,ph,T,425,true,"atm and atr DNA damage response",88,25561503,"MASCOT Score",41.0000000,1.0000000,,,,,1.6900000
HASEEYVSPESSMGMTAASAHT,ph,T,425,true,"Tissue atlas Arabidopsis - ProteomicsDB",114,32188942,"MaxQuant score",133.9300000,0.9769440,,,,2.4089300632802E-28,
