Peptide,PTM,ModifiedAA,ModifiedPosition,PeptideUniqueToGene,ExperimentDesc,ExpID,PubmedID,ScoreType,IdentScore,LocProb,Log2FChange,PQ-val,QuantSig,PEP,MassErrorPPM
STASSDRFSGLDK,ph,S,92,true,"Tissue atlas Arabidopsis - ProteomicsDB",114,32188942,"MaxQuant score",110.7800000,0.7761480,,,,0.00023517399677075,
VSMEEDSSVLTNGNSFR,ph,S,182,true,"Tissue atlas Arabidopsis - ProteomicsDB",114,32188942,"MaxQuant score",179.1000000,0.9996130,,,,3.8356598839083E-30,
FSIGESFRK,ph,S,226,true,"Tissue atlas Arabidopsis - ProteomicsDB",114,32188942,"MaxQuant score",71.1760000,0.9999990,,,,0.0016225799918175,
FSSLDHVK,ph,S,298,true,"Tissue atlas Arabidopsis - ProteomicsDB",114,32188942,"MaxQuant score",94.0870000,0.9998300,,,,0.0061224000528455,
RMLENKLTSMTTMFSSENGDSGSK,ph,S,332,true,"Brassinosteroid-Regulated Phosphorylation Dynamics",94,26187819,"MaxQuant Score",68.2910000,0.8160000,,,,0.035000000149012,-0.7830000
RMLENKLTSMTTMFSSENGDSGSK,ph,T,335,true,"Brassinosteroid-Regulated Phosphorylation Dynamics",94,26187819,"MaxQuant Score",68.2910000,0.8320000,,,,0.035000000149012,-0.7830000
SVSDITAVPR,ph,S,359,true,"Tissue atlas Arabidopsis - ProteomicsDB",114,32188942,"MaxQuant score",192.3800000,0.9882490,,,,1.3561399995598E-13,
SVSDITAVPR,ph,S,361,true,"TOR Kinase and ABA Receptor",100,29290610,XCorr,2.7719228,0.9948000,,,,0.002868999959901,
SVSDITAVPR,ph,S,361,true,"Tissue atlas Arabidopsis - ProteomicsDB",114,32188942,"MaxQuant score",183.9900000,0.9999700,,,,7.3641398534718E-10,
