Peptide,PTM,ModifiedAA,ModifiedPosition,PeptideUniqueToGene,ExperimentDesc,ExpID,PubmedID,ScoreType,IdentScore,LocProb,Log2FChange,PQ-val,QuantSig,PEP,MassErrorPPM
ILEGGSGIPR,ph,S,63,true,"Tissue atlas Arabidopsis - ProteomicsDB",114,32188942,"MaxQuant score",79.8200000,1.0000000,,,,0.0030489300843328,
YASCNTHLGIEQSR,sno,C,182,true,"Site-specific nitrosomeproteomic id - gsnor1-3",90b,25699590,XCorr,2.0800000,,,,,0.0031620000954717,-6.4700000
SANAIGPSPQINNNTAAGR,ph,S,342,true,"atm and atr DNA damage response",88,25561503,"MASCOT Score",75.0000000,1.0000000,,,,,0.0500000
SANAIGPSPQINNNTAAGR,ph,S,342,true,"Tissue atlas Arabidopsis - ProteomicsDB",114,32188942,"MaxQuant score",120.2700000,1.0000000,,,,3.8888999008216E-18,
SANAIGPSPQINNNTAAGR,ph,S,349,true,"Tissue atlas Arabidopsis - ProteomicsDB",114,32188942,"MaxQuant score",81.1570000,0.9964440,,,,2.3066200810717E-5,
NMNMPSTSLSPAGTSK,ph,S,380,true,"atm and atr DNA damage response",88,25561503,"MASCOT Score",37.0000000,0.9900000,,,,,1.5200000
NMNMPSTSLSPAGTSK,ph,S,380,true,"TOR Kinase and ABA Receptor",100,29290610,XCorr,3.9843421,0.7899000,,,,3.1169998692349E-5,
NMNMPSTSLSPAGTSK,ph,S,380,true,"Tissue atlas Arabidopsis - ProteomicsDB",114,32188942,"MaxQuant score",200.4800000,0.9997780,,,,3.3757560265278E-40,
NVGPETSNSGYGSGNR,ph,S,394,true,"Tissue atlas Arabidopsis - ProteomicsDB",114,32188942,"MaxQuant score",119.6800000,0.9175560,,,,1.4112499968633E-7,
NVGPETSNSGYGSGNR,ph,S,396,true,"Tissue atlas Arabidopsis - ProteomicsDB",114,32188942,"MaxQuant score",148.3300000,0.9890840,,,,4.7380299683653E-10,
NVGPETSNSGYGSGNR,ph,S,400,true,"Large-scale phosphorylation discovery",44,23111157,XCorr,4.2530000,,,,,,
NVGPETSNSGYGSGNR,ph,S,400,true,"atm and atr DNA damage response",88,25561503,"MASCOT Score",94.0000000,1.0000000,,,,,-0.4200000
NVGPETSNSGYGSGNR,ph,S,400,true,"Tissue atlas Arabidopsis - ProteomicsDB",114,32188942,"MaxQuant score",136.6600000,0.9998610,,,,4.2028300839547E-8,
TGWTSSFMSPEK,ph,S,412,true,"atm and atr DNA damage response",88,25561503,"MASCOT Score",35.0000000,1.0000000,,,,,0.6900000
TGWTSSFMSPEK,ph,S,412,true,"TOR Kinase and ABA Receptor",100,29290610,XCorr,3.6714473,1.0000000,,,,0.0001845999940997,
TGWTSSFMSPEK,ph,S,412,true,"Tissue atlas Arabidopsis - ProteomicsDB",114,32188942,"MaxQuant score",134.1300000,0.9994810,,,,2.7685800887411E-5,
