Peptide,PTM,ModifiedAA,ModifiedPosition,PeptideUniqueToGene,ExperimentDesc,ExpID,PubmedID,ScoreType,IdentScore,LocProb,Log2FChange,PQ-val,QuantSig,PEP,MassErrorPPM
SNSHSSLNHSMTSTDNEVQK,ph,S,140,true,"Tissue atlas Arabidopsis - ProteomicsDB",114,32188942,"MaxQuant score",48.0250000,0.7829700,,,,0.0007996570202522,
DVYETWQSPQK,ph,S,174,true,"Tissue atlas Arabidopsis - ProteomicsDB",114,32188942,"MaxQuant score",154.8500000,0.9999970,,,,2.033739981977E-10,
ASFSPESSVCR,ph,S,458,true,"atm and atr DNA damage response",88,25561503,"MASCOT Score",49.0000000,1.0000000,,,,,-0.5100000
ASFSPESSVCR,ph,S,458,true,"Tissue atlas Arabidopsis - ProteomicsDB",114,32188942,"MaxQuant score",130.3600000,0.9999800,,,,4.1839798541332E-6,
SKSVSDVR,ph,S,552,true,"atm and atr DNA damage response",88,25561503,"MASCOT Score",26.0000000,1.0000000,,,,,0.4500000
SNLIDKSPPIGSIAR,ph,S,717,true,"Tissue atlas Arabidopsis - ProteomicsDB",114,32188942,"MaxQuant score",88.0360000,0.9998520,,,,3.3835298381746E-5,
LLSWDDDSCTDNIAK,ph,S,728,true,"Tissue atlas Arabidopsis - ProteomicsDB",114,32188942,"MaxQuant score",201.3000000,1.0000000,,,,2.4685600194036E-36,
INSIVSETTTTR,ph,S,827,true,"Tissue atlas Arabidopsis - ProteomicsDB",114,32188942,"MaxQuant score",78.5050000,0.9997830,,,,0.0010872399434447,
