Peptide,PTM,ModifiedAA,ModifiedPosition,PeptideUniqueToGene,ExperimentDesc,ExpID,PubmedID,ScoreType,IdentScore,LocProb,Log2FChange,PQ-val,QuantSig,PEP,MassErrorPPM
PVPDPNSVGGGAKRDE,nt,P,3,true,"Arabidopsis translation initiation landscape - NT",167b,35069635,,,,,,,,
DEATTKIPSK,ub,K,22,true,"upl3 mutant / wildtype",168,35926874,"MaxQuant score",54.2590000,1.0000000,-0.1893513,,,0.019032200798392,0.0927240
IALESMRK,mox,M,72,true,"cat2 Methionine oxidation - 1h stress",62a,25693801,"MASCOT Score",38.0000000,,-0.8279361,,NO,,
QVFTSCTDLVK,so,C,280,true,"Arabidopsis S-sulfenylation chemoproteomics",108,31578252,"pFind PSM Score",0.0727193,,0.9523800,,,,0.9139375
QFCYMIAR,ox,C,290,false,"SPEAR - 50 mM H2O2 / mock",138b,34619326,,,,2.4100109,0.0015452,YES,,
DIEVMEAKTPEDIYK,ph,T,343,false,"TOR Kinase and ABA Receptor",100,29290610,XCorr,3.1130455,0.9932000,,,,0.0015869999770075,
DIEVMEAKTPEDIYK,ph,T,343,false,"Tissue atlas Arabidopsis - ProteomicsDB",114,32188942,"MaxQuant score",254.5800000,1.0000000,,,,0,
ASSGPSVDSAR,ph,S,359,true,"atm and atr DNA damage response",88,25561503,"MASCOT Score",47.0000000,0.9860000,,,,,0.1400000
ASSGPSVDSAR,ph,S,359,true,"Lateral root-induction - NAA vs control",106,23328941,"MASCOT Score",39.0000000,,0.0732257,0.8286321,NO,,
ASSGPSVDSAR,ph,S,359,true,"Tissue atlas Arabidopsis - ProteomicsDB",114,32188942,"MaxQuant score",117.7900000,0.9999210,,,,2.7237299946137E-5,
VQDLLAQCGEHLVK,so,C,621,true,"Arabidopsis S-sulfenylation chemoproteomics",108,31578252,"pFind PSM Score",0.0546581,,,,,,-0.8863771
VQDLLAQCGEHLVK,so,C,621,true,"S-sulfenylation site detection using YAP1C",110,32714340,,,,,,,,
AVPLALGLLCISNPK,so,C,680,false,"S-sulfenylation site detection using YAP1C",110,32714340,,,,,,,,
QTHSTPVLLAAGER,nt,Q,848,false,"FtsH12 N-terminome: WT / FtsH12 knockdown miRNA",118,33216923,"MaxQuant score",45.4890000,,,,,0.017249999567866,
STPVLLAAGER,nt,S,851,false,"Arabidopsis translation initiation landscape - NT",167b,35069635,,,,,,,,
