Peptide,PTM,ModifiedAA,ModifiedPosition,PeptideUniqueToGene,ExperimentDesc,ExpID,PubmedID,ScoreType,IdentScore,LocProb,Log2FChange,PQ-val,QuantSig,PEP,MassErrorPPM
ATTGTAAVATGTSTVKR,nt,A,2,true,"N-terminal ChaFRADIC",92,26010716,"MASCOT Score",54.6500000,,,,,3.6599999475584E-7,
ATTGTAAVATGTSTVKR,nt,A,2,true,"Stromal N-terminome",96,26371235,"MASCOT Score",89.1200000,,,,,,
ATTGTAAVATGTSTVKR,nt,A,2,true,"Arg/N-end rule seed, prt6 vs. Wt",99,29168982,"MASCOT Score",61.6000000,,,,,9.3950002337806E-5,-1.0141187
ATTGTAAVATGTSTVKR,nt,A,2,true,"FtsH12 N-terminome: WT / FtsH12 knockdown miRNA",118,33216923,"MaxQuant score",81.8840000,,0.6498972,0.0010725,YES,2.2400000420069E-13,
ATTGTAAVAT,nt,A,2,true,"N-term acetylation drought responses",5,26184543,,,,,,,,
ATTGTAAVATGTSTVKRKPVFVKVE,nta,A,2,true,"Arabidopsis translation initiation landscape - NTA",167a,35069635,,,,,,,,
ATTGTAAVATGTSTVKR,nta,A,2,true,"Arg/N-end rule pathway Roots",80,25728785,"MASCOT Score",97.3700000,,,,,9.5609998140844E-8,
ATTGTAAVATGTSTVKR,nta,A,2,true,"N-terminal ChaFRADIC",92,26010716,"MASCOT Score",54.6500000,,,,,3.6599999475584E-7,
ATTGTAAVATGTSTVKR,nta,A,2,true,"Stromal N-terminome",96,26371235,"MASCOT Score",89.1200000,,,,,,
ATTGTAAVATGTSTVKR,nta,A,2,true,"Arg/N-end rule seed, prt6 vs. Wt",99,29168982,"MASCOT Score",61.6000000,,0.1921973,0.1721808,NO,9.3950002337806E-5,-1.0141187
ATTGTAAVATGTSTVKR,nta,A,2,true,"HUNTER N-terminome: legumain, GluC and trypsin",119,31951383,"MaxQuant score",109.1600000,,,,,,
ATTGTAAVATGTSTVK,nta,A,2,true,"Characterization plant N-terminal acetylation",6,22223895,"MASCOT Score",108.5200000,,,,,,
ATTGTAAVAT,nta,A,2,true,"N-term acetylation drought responses",5,26184543,,,,,,,,
TAAVATGTSTVKR,nt,T,6,true,"Metacaspase9 substrates - in vitro rMC9",51c,23964026,"MASCOT Score",62.0000000,,1.6936342,,NO,,-0.5674522
MATTGTAAVATGTSTVK,ph,T,13,true,"BSK8 and BSL2 regulating sucrose-ph synthase",66,24924143,"MaxQuant Score",41.2920000,,,,,,0.7878400
MATTGTAAVATGTSTVK,ph,S,14,true,"BSK8 and BSL2 regulating sucrose-ph synthase",66,24924143,"MaxQuant Score",41.2920000,,,,,,0.7878400
ATTGTAAVATGTSTVKR,ub,K,17,true,"Arabidopsis ubiquitination COFRADIC",40,26744219,"MaxQuant Score",177.5800000,1.0000000,,,,0,-0.5010000
ATTGTAAVATGTSTVKR,ub,K,17,true,"upl3 mutant / wildtype",168,35926874,"MaxQuant score",185.6700000,1.0000000,-0.9159357,0.0429610,YES,1.0788199620737E-27,-0.6405400
VIEANIVVPVTRK,ph,T,51,true,"Tissue atlas Arabidopsis - ProteomicsDB",114,32188942,"MaxQuant score",162.3700000,1.0000000,,,,1.0523000248952E-9,
IDMFKGTMR,ub,K,110,true,"Arabidopsis ubiquitination COFRADIC",40,26744219,"MaxQuant Score",45.5980000,1.0000000,,,,0.012000000104308,-0.7300000
GTMRLGVDK,mox,M,113,true,"cat2 Methionine oxidation - 1h stress",62a,25693801,"MASCOT Score",34.0000000,,-0.1954508,,NO,,
IEATGAASFTVK,ph,S,130,true,"Tissue atlas Arabidopsis - ProteomicsDB",114,32188942,"MaxQuant score",80.7060000,0.7962950,,,,0.001268699998036,
