Peptide,PTM,ModifiedAA,ModifiedPosition,PeptideUniqueToGene,ExperimentDesc,ExpID,PubmedID,ScoreType,IdentScore,LocProb,Log2FChange,PQ-val,QuantSig,PEP,MassErrorPPM
STPVKLESGR,ph,T,87,true,"Tissue atlas Arabidopsis - ProteomicsDB",114,32188942,"MaxQuant score",74.6980000,0.8000660,,,,0.0047560799866915,
RSGSESPPSAPIVVK,ph,S,102,true,"atm and atr DNA damage response",88,25561503,"MASCOT Score",30.0000000,1.0000000,,,,,0.7900000
RSGSESPPSAPIVVK,ph,S,102,true,"TOR Kinase and ABA Receptor",100,29290610,XCorr,3.9174554,0.9813000,,,,0.00015619999612682,
SGSESPPSAPIVVK,ph,S,102,true,"atm and atr DNA damage response",88,25561503,"MASCOT Score",52.0000000,1.0000000,,,,,-0.3700000
SGSESPPSAPIVVK,ph,S,102,true,"Tissue atlas Arabidopsis - ProteomicsDB",114,32188942,"MaxQuant score",173.5400000,0.9928670,,,,4.8212501258828E-16,
RSGSESPPSAPIVVK,ph,S,104,true,"atm and atr DNA damage response",88,25561503,"MASCOT Score",30.0000000,1.0000000,,,,,0.7900000
RSGSESPPSAPIVVK,ph,S,104,true,"TOR Kinase and ABA Receptor",100,29290610,XCorr,3.9174554,0.8910000,,,,0.00015619999612682,
SGSESPPSAPIVVK,ph,S,104,true,"Large-scale phosphorylation discovery",44,23111157,XCorr,2.5370000,,,,,,
SGSESPPSAPIVVK,ph,S,104,true,"atm and atr DNA damage response",88,25561503,"MASCOT Score",52.0000000,1.0000000,,,,,-0.3700000
SGSESPPSAPIVVK,ph,S,104,true,"Tissue atlas Arabidopsis - ProteomicsDB",114,32188942,"MaxQuant score",209.8300000,0.9999790,,,,1.8006685266574E-42,
YLDLNDSDDEEVGSEDEGVVR,ph,S,123,true,"TOR Kinase and ABA Receptor",100,29290610,XCorr,2.8950605,0.8019000,,,,0.00026649999199435,
YLDLNDSDDEEVGSEDEGVVR,ph,S,130,true,"TOR Kinase and ABA Receptor",100,29290610,XCorr,2.8950605,0.9997000,,,,0.00026649999199435,
KLSDDFDR,ph,S,143,false,"atm and atr DNA damage response",88,25561503,"MASCOT Score",39.0000000,1.0000000,,,,,-1.3500000
KLSDDFDR,ph,S,143,false,"Tissue atlas Arabidopsis - ProteomicsDB",114,32188942,"MaxQuant score",145.9500000,1.0000000,,,,0.0015008399495855,
