Peptide,PTM,ModifiedAA,ModifiedPosition,PeptideUniqueToGene,ExperimentDesc,ExpID,PubmedID,ScoreType,IdentScore,LocProb,Log2FChange,PQ-val,QuantSig,PEP,MassErrorPPM
ASGSSGRVNSGSKGFD,nt,A,2,true,"Arg/N-end rule seed, prt6 vs. Wt",99,29168982,"MASCOT Score",25.0500000,,,,,0.0017920000245795,-1.3034449
ASGSSGRVNSGSKGFD,nta,A,2,true,"Arg/N-end rule seed, prt6 vs. Wt",99,29168982,"MASCOT Score",25.0500000,,-0.2863822,0.0744274,NO,0.0017920000245795,-1.3034449
ASGSSGRVNSGSKGF,nta,A,2,true,"Arabidopsis translation initiation landscape - NTA",167a,35069635,,,,,,,,
SSVFPTSSYSPPEDSLSQDITDTVER,ph,S,69,true,"Lateral root-induction - NAA vs control",106,23328941,"MASCOT Score",44.0000000,,-0.0240611,0.8359164,NO,,
SSVFPTSSYSPPEDSLSQDITDTVER,ph,S,69,true,"Col-0 callus - FC Col-0 vs. Col-0 Xray",111a,31410901,,47.3400000,,0.2390322,0.0000000,NO,,1.3147589
SSVFPTSSYSPPEDSLSQDITDTVER,ph,S,69,true,"Col-0 X-ray callus - FC Col-0 vs. Col-0 Xray",111b,31410901,,47.3400000,,0.2390322,0.0000000,NO,,1.3147589
SSVFPTSSYSPPEDSLSQDITDTVER,ph,S,69,true,"atm callus - FC atm vs. atm Xray",111c,31410901,,47.3400000,,0.7840860,0.0000000,NO,,1.3147589
SSVFPTSSYSPPEDSLSQDITDTVER,ph,S,69,true,"atm-3 X-ray callus - FC atm vs. atm Xray",111d,31410901,,47.3400000,,0.7840860,0.0000000,NO,,1.3147589
SSVFPTSSYSPPEDSLSQDITDTVER,ph,Y,70,true,"Lateral root-induction - NAA vs control",106,23328941,"MASCOT Score",24.0000000,,,,,,
SSVFPTSSYSPPEDSLSQDITDTVER,ph,S,71,true,"srk2dei ABA signaling phopshoproteomics",83,23572148,"MASCOT Score",44.0000000,,,,,,-0.0013000
SSVFPTSSYSPPEDSLSQDITDTVER,ph,S,71,true,"SnRK2 protein kinase substrates",85,23776212,XCorr,4.8305202,0.9750000,,,,0.0015326599823311,
SSVFPTSSYSPPEDSLSQDITDTVER,ph,S,71,true,"Lateral root-induction - NAA vs control",106,23328941,"MASCOT Score",27.0000000,,,,,,
SSVFPTSSYSPPEDSLSQDITDTVER,ph,S,76,true,"srk2dei ABA signaling phopshoproteomics",83,23572148,"MASCOT Score",50.0000000,,,,,,-0.0013000
SELTHAHEDADVKLR,ub,K,138,true,"Arabidopsis ubiquitination COFRADIC",40,26744219,"MaxQuant Score",71.9800000,1.0000000,,,,1.6169999526028E-6,-0.2510000
SLDKHLQEVHR,nt,S,141,true,"Arabidopsis translation initiation landscape - NT",167b,35069635,,,,,,,,
VATPVPEPK,ph,T,194,true,"STN8 phosphoproteome",38,21768351,"MASCOT Score",48.0500000,,,,,,0.5867570
VATPVPEPK,ph,T,194,true,"Pollen phosphoproteome Arabidopsis",43,22631563,"MASCOT Score",43.4300000,,,,,,-0.0219757
VATPVPEPK,ph,T,194,true,"Chloroplast kinase substrates",60,19376835,"MASCOT Score",40.8100000,,,,,,0.5278480
VATPVPEPK,ph,T,194,true,"LAXIC - ABA stress",84a,23660473,XCorr,2.0600000,1.0000000,,,,0.07120169699192,
VATPVPEPK,ph,T,194,true,"LAXIC - mannitol vs control",84b,23660473,XCorr,2.7200000,1.0000000,,,,0.00022331699437927,
VATPVPEPK,ph,T,194,true,"SnRK2 protein kinase substrates",85,23776212,XCorr,2.6901183,1.0000000,,,,0.047560300678015,
VATPVPEPK,ph,T,194,true,"atm and atr DNA damage response",88,25561503,"MASCOT Score",36.0000000,1.0000000,,,,,-0.8100000
VATPVPEPK,ph,T,194,true,"TOR Kinase and ABA Receptor",100,29290610,XCorr,3.2642677,1.0000000,,,,0.0021979999728501,
VATPVPEPK,ph,T,194,true,"Lateral root-induction - NAA vs control",106,23328941,"MASCOT Score",38.0000000,,-0.6710450,0.0014610,YES,,
VATPVPEPK,ph,T,194,true,"Phospho cell culture sucrose/TOR",109,30833711,,,1.0000000,,,,,
VATPVPEPK,ph,T,194,true,"Col-0 callus - FC Col-0 vs. Col-0 Xray",111a,31410901,,45.3500000,,-0.9031966,0.0000000,NO,,-0.2755650
VATPVPEPK,ph,T,194,true,"Col-0 X-ray callus - FC Col-0 vs. Col-0 Xray",111b,31410901,,45.3500000,,-0.9031966,0.0000000,NO,,-0.2755650
VATPVPEPK,ph,T,194,true,"atm callus - FC atm vs. atm Xray",111c,31410901,,45.3500000,,-0.5581653,0.0000000,NO,,-0.2755650
VATPVPEPK,ph,T,194,true,"atm-3 X-ray callus - FC atm vs. atm Xray",111d,31410901,,45.3500000,,-0.5581653,0.0000000,NO,,-0.2755650
VATPVPEPK,ph,T,194,true,"Tissue atlas Arabidopsis - ProteomicsDB",114,32188942,"MaxQuant score",166.3900000,1.0000000,,,,2.8025969286496E-45,
LSGQSSGGPPR,ph,S,489,true,"Tissue atlas Arabidopsis - ProteomicsDB",114,32188942,"MaxQuant score",61.4230000,0.8733850,,,,0.0081880800426006,
