Peptide,PTM,ModifiedAA,ModifiedPosition,PeptideUniqueToGene,ExperimentDesc,ExpID,PubmedID,ScoreType,IdentScore,LocProb,Log2FChange,PQ-val,QuantSig,PEP,MassErrorPPM
RGVSLGPAEIFNSAK,ph,S,168,true,"Tissue atlas Arabidopsis - ProteomicsDB",114,32188942,"MaxQuant score",106.5700000,1.0000000,,,,5.6650501392141E-6,
KSETVTPLQSAQNR,ph,T,185,true,"Tissue atlas Arabidopsis - ProteomicsDB",114,32188942,"MaxQuant score",68.6510000,0.8281060,,,,0.00038980500539765,
LPGIEEGQVTTR,ph,T,210,true,"Tissue atlas Arabidopsis - ProteomicsDB",114,32188942,"MaxQuant score",116.3600000,0.8825410,,,,0.00011425300181145,
GRTSLSLSPR,ph,S,220,true,"Col-0 callus - FC Col-0 vs. Col-0 Xray",111a,31410901,,28.2700000,,-2.4704609,0.0236316,YES,,1.1759434
GRTSLSLSPR,ph,S,220,true,"Col-0 X-ray callus - FC Col-0 vs. Col-0 Xray",111b,31410901,,28.2700000,,-2.4704609,0.0236316,YES,,1.1759434
GRTSLSLSPR,ph,S,220,true,"atm callus - FC atm vs. atm Xray",111c,31410901,,28.2700000,,-1.6066283,0.1126447,NO,,1.1759434
GRTSLSLSPR,ph,S,220,true,"atm-3 X-ray callus - FC atm vs. atm Xray",111d,31410901,,28.2700000,,-1.6066283,0.1126447,NO,,1.1759434
TSLSLSPR,ph,S,222,false,"Tissue atlas Arabidopsis - ProteomicsDB",114,32188942,"MaxQuant score",187.9700000,0.9999920,,,,2.3699299163127E-6,
YSQMGKTQTGEKDVR,ub,K,291,true,"Arabidopsis ubiquitination COFRADIC",40,26744219,"MaxQuant Score",79.6520000,1.0000000,,,,8.9859997842723E-7,0.2420000
KRSLPEDEEK,ph,S,303,true,"TOR Kinase and ABA Receptor",100,29290610,XCorr,2.2569401,1.0000000,,,,0.0023419999051839,
