Peptide,PTM,ModifiedAA,ModifiedPosition,PeptideUniqueToGene,ExperimentDesc,ExpID,PubmedID,ScoreType,IdentScore,LocProb,Log2FChange,PQ-val,QuantSig,PEP,MassErrorPPM
ADVVQYRLE,nt,A,2,true,"Arg/N-end rule seed, prt6 vs. Wt",99,29168982,"MASCOT Score",37.7000000,,,,,0.027760000899434,-0.3044478
ADVVQYRLE,nta,A,2,true,"Arg/N-end rule seed, prt6 vs. Wt",99,29168982,"MASCOT Score",37.7000000,,,,,0.027760000899434,-0.3044478
VALGEDKGSLVR,ph,S,209,true,"Tissue atlas Arabidopsis - ProteomicsDB",114,32188942,"MaxQuant score",78.2440000,1.0000000,,,,0.00046427300549112,
ELFMSLDEK,ph,S,232,true,"Tissue atlas Arabidopsis - ProteomicsDB",114,32188942,"MaxQuant score",103.0800000,1.0000000,,,,0.00056543701793998,
EGNEKEENDEDSIVEDVEDVTEK,ph,S,248,true,"Phospho cell culture sucrose/TOR",109,30833711,,,0.9999170,,,,,
EGNEKEENDEDSIVEDVEDVTEK,ph,S,248,true,"Tissue atlas Arabidopsis - ProteomicsDB",114,32188942,"MaxQuant score",161.0400000,1.0000000,,,,3.1546997924821E-39,
EENDEDSIVEDVEDVTEK,ph,S,248,true,"TOR Kinase and ABA Receptor",100,29290610,XCorr,5.4860306,1.0000000,,,,7.8050000240637E-8,
SLSENSSPSK,ph,S,472,true,"atm and atr DNA damage response",88,25561503,"MASCOT Score",29.0000000,0.9430000,,,,,1.8500000
