Peptide,PTM,ModifiedAA,ModifiedPosition,PeptideUniqueToGene,ExperimentDesc,ExpID,PubmedID,ScoreType,IdentScore,LocProb,Log2FChange,PQ-val,QuantSig,PEP,MassErrorPPM
ESGSTDGDSPTEK,ph,S,144,true,"atm and atr DNA damage response",88,25561503,"MASCOT Score",33.0000000,0.9200000,,,,,0.2100000
ESGSTDGDSPTEKDAGDSNSGLSPKPK,ph,S,146,true,"Tissue atlas Arabidopsis - ProteomicsDB",114,32188942,"MaxQuant score",235.8600000,0.9960880,,,,0,
KESGSTDGDSPTEK,ph,S,146,true,"SnRK2 protein kinase substrates",85,23776212,XCorr,4.0044022,0.9960000,,,,2.7591999241849E-5,
KESGSTDGDSPTEK,ph,S,146,true,"atm and atr DNA damage response",88,25561503,"MASCOT Score",50.0000000,0.9490000,,,,,-1.1100000
ESGSTDGDSPTEK,ph,S,146,true,"SnRK2 protein kinase substrates",85,23776212,XCorr,2.8379204,0.8290000,,,,0.015388799831271,
ESGSTDGDSPTEK,ph,S,146,true,"atm and atr DNA damage response",88,25561503,"MASCOT Score",104.0000000,0.9060000,,,,,0.1400000
ESGSTDGDSPTEK,ph,T,147,true,"atm and atr DNA damage response",88,25561503,"MASCOT Score",63.0000000,1.0000000,,,,,-0.2300000
ESGSTDGDSPTEKDAGDSNSGLSPKPK,ph,S,151,true,"Tissue atlas Arabidopsis - ProteomicsDB",114,32188942,"MaxQuant score",66.8800000,0.7811980,,,,4.7261900704143E-7,
KESGSTDGDSPTEK,ph,S,151,true,"atm and atr DNA damage response",88,25561503,"MASCOT Score",39.0000000,1.0000000,,,,,-0.9600000
ESGSTDGDSPTEK,ph,S,151,true,"atm and atr DNA damage response",88,25561503,"MASCOT Score",65.0000000,1.0000000,,,,,0.0700000
DAGDSNSGLSPKPK,ph,S,160,true,"Tissue atlas Arabidopsis - ProteomicsDB",114,32188942,"MaxQuant score",66.5530000,0.9669320,,,,0.001552699948661,
KESGSTDGDSPTEKDAGDSNSGLSPKPK,ph,S,165,true,"SnRK2 protein kinase substrates",85,23776212,XCorr,3.7703264,0.9150000,,,,0.0021128898952156,
DAGDSNSGLSPKPK,ph,S,165,true,"STN8 phosphoproteome",38,21768351,"MASCOT Score",57.3600000,,,,,,1.3763300
DAGDSNSGLSPKPK,ph,S,165,true,"LAXIC - mannitol vs control",84b,23660473,XCorr,2.7400000,1.0000000,,,,1.2900000001537E-5,
DAGDSNSGLSPKPK,ph,S,165,true,"SnRK2 protein kinase substrates",85,23776212,XCorr,2.9668779,1.0000000,,,,7.8183502409956E-6,
DAGDSNSGLSPKPK,ph,S,165,true,"atm and atr DNA damage response",88,25561503,"MASCOT Score",59.0000000,0.9460000,,,,,-2.3800000
DAGDSNSGLSPKPK,ph,S,165,true,"TOR Kinase and ABA Receptor",100,29290610,XCorr,3.9569464,0.9993000,,,,1.4040000451132E-6,
DAGDSNSGLSPKPK,ph,S,165,true,"Phospho cell culture sucrose/TOR",109,30833711,,,0.9993500,,,,,
DAGDSNSGLSPKPK,ph,S,165,true,"Tissue atlas Arabidopsis - ProteomicsDB",114,32188942,"MaxQuant score",349.2000000,1.0000000,,,,0,
DAGDSNSGLSPK,ph,S,165,true,"atm and atr DNA damage response",88,25561503,"MASCOT Score",68.0000000,1.0000000,,,,,-0.5100000
SVGACEAQSAEGAAK,ph,S,175,true,"atm and atr DNA damage response",88,25561503,"MASCOT Score",46.0000000,1.0000000,,,,,-0.7700000
SVGACEAQSAEGAAK,ph,S,175,true,"Tissue atlas Arabidopsis - ProteomicsDB",114,32188942,"MaxQuant score",106.7900000,1.0000000,,,,2.8899798962811E-6,
SVGACEAQSAEGAAK,ox,C,179,true,"SPEAR - 50 mM H2O2 / mock",138b,34619326,,,,2.5413787,0.0004126,YES,,
SVGACEAQSAEGAAK,ph,S,183,true,"Tissue atlas Arabidopsis - ProteomicsDB",114,32188942,"MaxQuant score",121.4500000,1.0000000,,,,3.1742199553264E-6,
EFAILAAMPCK,ox,C,363,true,"SPEAR - 10 mM H2O2 / mock",138a,34619326,,,,2.0319556,0.0117134,YES,,
EFAILAAMPCK,ox,C,363,true,"SPEAR - 50 mM H2O2 / mock",138b,34619326,,,,2.1054443,0.0150623,YES,,
IVENNQCSLK,sno,C,404,true,"hot5-4 / wildtype, FAT-switch S-nitrosoproteome",169,37277371,,,,-3.1856801,0.0010978,YES,,
SSTPSSLAQR,ph,S,534,true,"atm and atr DNA damage response",88,25561503,"MASCOT Score",29.0000000,0.9920000,,,,,-0.2800000
SSTPSSLAQRSPNADSEQIR,ph,T,535,true,"atm and atr DNA damage response",88,25561503,"MASCOT Score",28.0000000,0.9750000,,,,,-0.9200000
SSTPSSLAQR,ph,T,535,true,"STN8 phosphoproteome",38,21768351,"MASCOT Score",43.3600000,,,,,,0.6735010
SSTPSSLAQR,ph,T,535,true,"Large-scale phosphorylation discovery",44,23111157,XCorr,3.3590000,,,,,,
SSTPSSLAQR,ph,T,535,true,"Chloroplast kinase substrates",60,19376835,"MASCOT Score",41.8300000,,,,,,0.3325410
SSTPSSLAQR,ph,T,535,true,"srk2dei ABA signaling phopshoproteomics",83,23572148,"MASCOT Score",51.0000000,,,,,,0.0001000
SSTPSSLAQR,ph,T,535,true,"SnRK2 protein kinase substrates",85,23776212,XCorr,2.4222674,0.9920000,,,,0.0077597401104867,
SSTPSSLAQR,ph,T,535,true,"TOR Kinase and ABA Receptor",100,29290610,XCorr,3.3272333,0.9879000,,,,0.0001845999940997,
SSTPSSLAQR,ph,T,535,true,"Phospho cell culture sucrose/TOR",109,30833711,,,0.9971520,,,,,
SSTPSSLAQR,ph,T,535,true,"Tissue atlas Arabidopsis - ProteomicsDB",114,32188942,"MaxQuant score",158.4700000,0.9999400,,,,1.8183300198871E-6,
SSTPSSLAQRSPNADSEQIR,ph,S,543,true,"atm and atr DNA damage response",88,25561503,"MASCOT Score",28.0000000,1.0000000,,,,,-0.9200000
SPNADSEQIR,ph,S,543,true,"atm and atr DNA damage response",88,25561503,"MASCOT Score",44.0000000,1.0000000,,,,,-0.0600000
SPNADSEQIR,ph,S,543,true,"Tissue atlas Arabidopsis - ProteomicsDB",114,32188942,"MaxQuant score",163.4500000,1.0000000,,,,4.2582499304444E-7,
EAPANDTDNTSETEDQKELEKQNEEIEK,ph,T,652,true,"Tissue atlas Arabidopsis - ProteomicsDB",114,32188942,"MaxQuant score",138.6900000,0.8169170,,,,0,
EAPANDTDNTSETEDQKELEK,ph,S,653,true,"STN8 phosphoproteome",38,21768351,"MASCOT Score",52.4200000,,,,,,-2.0408400
EAPANDTDNTSETEDQKELEK,ph,S,653,true,"Tissue atlas Arabidopsis - ProteomicsDB",114,32188942,"MaxQuant score",404.4800000,0.9960810,,,,0,
EAPANDTDNTSETEDQK,ph,S,653,true,"atm and atr DNA damage response",88,25561503,"MASCOT Score",53.0000000,0.9520000,,,,,0.0600000
HEGCQELR,sno,C,837,true,"hot5-4 / wildtype, FAT-switch S-nitrosoproteome",169,37277371,,,,,,,,
HVACSSADGR,sno,C,887,true,"Site-specific nitrosomeproteomic id - gsnor1-3",90b,25699590,XCorr,2.1200000,,,,,0.14720000326633,-5.9200000
HVACSSADGR,sno,C,887,true,"hot5-4 / wildtype, FAT-switch S-nitrosoproteome",169,37277371,,,,,,,,
HVACSSADGR,so,C,887,true,"Arabidopsis S-sulfenylation chemoproteomics",108,31578252,"pFind PSM Score",0.1241200,,1.3706100,,,,-0.8741111
QATIYQQKALDIN,nt,Q,952,false,"HUNTER N-terminome: legumain, GluC and trypsin",119,31951383,"MaxQuant score",73.8480000,,,,,,
NGTPKPDASISSK,ph,T,1126,true,"atm and atr DNA damage response",88,25561503,"MASCOT Score",46.0000000,1.0000000,,,,,-2.3100000
NGTPKPDASISSK,ph,T,1126,true,"TOR Kinase and ABA Receptor",100,29290610,XCorr,2.7788162,1.0000000,,,,0.00036730000283569,
NGTPKPDASISSK,ph,T,1126,true,"Tissue atlas Arabidopsis - ProteomicsDB",114,32188942,"MaxQuant score",219.5900000,1.0000000,,,,0,
GKPGQSPGPVSEENQK,ph,S,1174,true,"TOR Kinase and ABA Receptor",100,29290610,XCorr,5.2139220,1.0000000,,,,4.2690000867651E-8,
GKPGQSPGPVSEENQK,ph,S,1174,true,"Tissue atlas Arabidopsis - ProteomicsDB",114,32188942,"MaxQuant score",70.3150000,0.9999700,,,,0.0001331300009042,
GKPGQSPGPVSEENQKDDEILSPAHLTGESSSDK,ph,S,1190,true,"TOR Kinase and ABA Receptor",100,29290610,XCorr,3.9293864,0.7691000,,,,0.021619999781251,
DDEILSPAHLTGESSSDKENK,ph,S,1190,true,"Tissue atlas Arabidopsis - ProteomicsDB",114,32188942,"MaxQuant score",263.5400000,1.0000000,,,,0,
DDEILSPAHLTGESSSDK,ph,S,1190,true,"srk2dei ABA signaling phopshoproteomics",83,23572148,"MASCOT Score",53.0000000,,,,,,0.0007000
DDEILSPAHLTGESSSDK,ph,S,1190,true,"TOR Kinase and ABA Receptor",100,29290610,XCorr,4.9247432,0.9979000,,,,9.3869999773233E-7,
GKPGQSPGPVSEENQKDDEILSPAHLTGESSSDK,ph,T,1195,true,"srk2dei ABA signaling phopshoproteomics",83,23572148,"MASCOT Score",32.0000000,,,,,,-0.0002000
DDEILSPAHLTGESSSDKENK,ph,T,1195,true,"Tissue atlas Arabidopsis - ProteomicsDB",114,32188942,"MaxQuant score",269.2800000,0.9304270,,,,0,
DDEILSPAHLTGESSSDK,ph,T,1195,true,"srk2dei ABA signaling phopshoproteomics",83,23572148,"MASCOT Score",44.0000000,,,,,,-0.0006000
DDEILSPAHLTGESSSDK,ph,T,1195,true,"TOR Kinase and ABA Receptor",100,29290610,XCorr,5.4803352,0.8157000,,,,0.00028380000730976,
DDEILSPAHLTGESSSDK,ph,S,1198,true,"srk2dei ABA signaling phopshoproteomics",83,23572148,"MASCOT Score",37.0000000,,,,,,-0.0005000
DDEILSPAHLTGESSSDK,ph,S,1199,true,"srk2dei ABA signaling phopshoproteomics",83,23572148,"MASCOT Score",62.0000000,,,,,,0.0032000
DDEILSPAHLTGESSSDKENK,ph,S,1200,true,"Tissue atlas Arabidopsis - ProteomicsDB",114,32188942,"MaxQuant score",249.4800000,0.8697660,,,,0,
DDEILSPAHLTGESSSDK,ph,S,1200,true,"srk2dei ABA signaling phopshoproteomics",83,23572148,"MASCOT Score",74.0000000,,,,,,0.0020000
LVKPEATVHEDDDSDEGWQEAVPK,ph,S,1244,true,"ABA-induced protein phosphorylation",35,20733066,,,,,,,,
LVKPEATVHEDDDSDEGWQEAVPK,ph,S,1244,true,"STN8 phosphoproteome",38,21768351,"MASCOT Score",81.1300000,,,,,,-0.7056010
LVKPEATVHEDDDSDEGWQEAVPK,ph,S,1244,true,"PAMP-triggered phosphorylation",48,24601666,"MASCOT Score",24.0100000,,,,,,
LVKPEATVHEDDDSDEGWQEAVPK,ph,S,1244,true,"Chloroplast kinase substrates",60,19376835,"MASCOT Score",77.6500000,,,,,,-0.9001090
LVKPEATVHEDDDSDEGWQEAVPK,ph,S,1244,true,"srk2dei ABA signaling phopshoproteomics",83,23572148,"MASCOT Score",80.0000000,,,,,,0.0008000
LVKPEATVHEDDDSDEGWQEAVPK,ph,S,1244,true,"LAXIC - ABA stress",84a,23660473,XCorr,3.6300000,1.0000000,,,,0.003030699910596,
LVKPEATVHEDDDSDEGWQEAVPK,ph,S,1244,true,"SnRK2 protein kinase substrates",85,23776212,XCorr,5.0013881,1.0000000,,,,2.6829999114852E-5,
LVKPEATVHEDDDSDEGWQEAVPK,ph,S,1244,true,"TOR Kinase and ABA Receptor",100,29290610,XCorr,5.1090341,1.0000000,,,,2.6969998998538E-6,
LVKPEATVHEDDDSDEGWQEAVPK,ph,S,1244,true,"Tissue atlas Arabidopsis - ProteomicsDB",114,32188942,"MaxQuant score",301.7700000,1.0000000,,,,0,
LNTNFMNVTQQPSR,ph,T,1272,true,"Tissue atlas Arabidopsis - ProteomicsDB",114,32188942,"MaxQuant score",142.6200000,1.0000000,,,,6.5227999357376E-7,
LNTNFMNVTQQPSR,ph,S,1282,true,"Tissue atlas Arabidopsis - ProteomicsDB",114,32188942,"MaxQuant score",259.4000000,1.0000000,,,,0,
STNFTSPR,ph,S,1293,true,"STN8 phosphoproteome",38,21768351,"MASCOT Score",46.1000000,,,,,,1.3717600
STNFTSPR,ph,S,1293,true,"Large-scale phosphorylation discovery",44,23111157,XCorr,2.6430000,,,,,,
STNFTSPR,ph,S,1293,true,"Chloroplast kinase substrates",60,19376835,"MASCOT Score",33.3900000,,,,,,2.1593100
STNFTSPR,ph,S,1293,true,"atm and atr DNA damage response",88,25561503,"MASCOT Score",33.0000000,0.9950000,,,,,-0.4200000
STNFTSPR,ph,S,1293,true,"TOR Kinase and ABA Receptor",100,29290610,XCorr,3.1968341,0.9981000,,,,0.0013409999664873,
STNFTSPR,ph,S,1293,true,"Tissue atlas Arabidopsis - ProteomicsDB",114,32188942,"MaxQuant score",169.9300000,0.9957280,,,,0.00052241201046854,
TSSNELSISVAGSTSSPASK,ph,T,1309,true,"Tissue atlas Arabidopsis - ProteomicsDB",114,32188942,"MaxQuant score",303.7300000,0.7823730,,,,0,
TSSNELSISVAGSTSSPASK,ph,S,1310,true,"Tissue atlas Arabidopsis - ProteomicsDB",114,32188942,"MaxQuant score",262.1700000,0.7655200,,,,0,
TSSNELSISVAGSTSSPASK,ph,S,1311,true,"srk2dei ABA signaling phopshoproteomics",83,23572148,"MASCOT Score",57.0000000,,,,,,-0.0030000
TSSNELSISVAGSTSSPASK,ph,S,1311,true,"SnRK2 protein kinase substrates",85,23776212,XCorr,2.5899415,0.9810000,,,,3.5752300391323E-6,
TSSNELSISVAGSTSSPASK,ph,S,1311,true,"atm and atr DNA damage response",88,25561503,"MASCOT Score",29.0000000,0.9580000,,,,,-0.7500000
TSSNELSISVAGSTSSPASK,ph,S,1311,true,"Tissue atlas Arabidopsis - ProteomicsDB",114,32188942,"MaxQuant score",296.6000000,0.9114350,,,,0,
MFVKSPLNKK,ph,S,1320,true,"srk2dei ABA signaling phopshoproteomics",83,23572148,"MASCOT Score",31.0000000,,,,,,-0.0002000
MFVKSPLNKK,ph,S,1320,true,"Tissue atlas Arabidopsis - ProteomicsDB",114,32188942,"MaxQuant score",239.5500000,1.0000000,,,,1.531619221507E-42,
MFVKSPLNK,ph,S,1320,true,"MAPK Arabidopsis substrates",45,23172892,"MaxQuant Score",88.4950000,,,,,,
MFVKSPLNK,ph,S,1320,true,"Chloroplast kinase substrates",60,19376835,"MASCOT Score",50.2700000,,,,,,0.2633350
MFVKSPLNK,ph,S,1320,true,"srk2dei ABA signaling phopshoproteomics",83,23572148,"MASCOT Score",38.0000000,,,,,,-0.0002000
MFVKSPLNK,ph,S,1320,true,"atm and atr DNA damage response",88,25561503,"MASCOT Score",39.0000000,1.0000000,,,,,-2.7200000
QNNSSVVGERPVNDK,ph,S,1330,true,"Tissue atlas Arabidopsis - ProteomicsDB",114,32188942,"MaxQuant score",61.7570000,0.8017740,,,,0.00034047799999826,
SALASSACTEQINKPTPMLSPVSVK,ph,S,1360,true,"Large-scale phosphorylation discovery",44,23111157,XCorr,6.4220000,,,,,,
SALASSACTEQINKPTPMLSPVSVK,ph,S,1360,true,"TOR Kinase and ABA Receptor",100,29290610,XCorr,5.4283895,0.9810000,,,,1.5859999424883E-10,
SALASSACTEQINKPTPMLSPVSVK,ph,S,1360,true,"Phospho cell culture sucrose/TOR",109,30833711,,,0.7722340,,,,,
SALASSACTEQINKPTPMLSPVSVK,ph,S,1360,true,"Tissue atlas Arabidopsis - ProteomicsDB",114,32188942,"MaxQuant score",295.7200000,0.9917120,,,,0,
PTPMLSPVSVK,ph,S,1360,true,"atm and atr DNA damage response",88,25561503,"MASCOT Score",27.0000000,1.0000000,,,,,-0.2200000
SALASSACTEQINKPTPMLSPVSVK,ph,S,1363,true,"Large-scale phosphorylation discovery",44,23111157,XCorr,4.7860000,,,,,,
SALASSACTEQINKPTPMLSPVSVK,ph,S,1363,true,"Tissue atlas Arabidopsis - ProteomicsDB",114,32188942,"MaxQuant score",130.4200000,0.9995900,,,,3.3322599388861E-29,
VNAQDAESENKHVATETEAENTDCNEQGR,ph,S,1421,true,"Tissue atlas Arabidopsis - ProteomicsDB",114,32188942,"MaxQuant score",125.4200000,0.9279210,,,,7.5529987227108E-43,
HVATETEAENTDCNEQGR,ph,T,1428,true,"Tissue atlas Arabidopsis - ProteomicsDB",114,32188942,"MaxQuant score",78.5310000,0.9841840,,,,1.3541300025732E-10,
VVVGGSELTSSPK,ph,S,1448,true,"atm and atr DNA damage response",88,25561503,"MASCOT Score",26.0000000,1.0000000,,,,,-1.1700000
VVVGGSELTSSPKEIK,ph,T,1451,true,"Tissue atlas Arabidopsis - ProteomicsDB",114,32188942,"MaxQuant score",273.9400000,0.9071230,,,,0,
VVVGGSELTSSPKEIK,ph,S,1452,true,"Tissue atlas Arabidopsis - ProteomicsDB",114,32188942,"MaxQuant score",105.2000000,0.7528090,,,,3.4325400974922E-6,
VVVGGSELTSSPK,ph,S,1452,true,"atm and atr DNA damage response",88,25561503,"MASCOT Score",30.0000000,0.8650000,,,,,-1.2600000
VVVGGSELTSSPKEIKNVEVEK,ph,S,1453,true,"SnRK2 protein kinase substrates",85,23776212,XCorr,2.6421390,0.8160000,,,,7.1856402428239E-7,
VVVGGSELTSSPKEIK,ph,S,1453,true,"SnRK2 protein kinase substrates",85,23776212,XCorr,3.8942051,0.9570000,,,,3.96250006599E-16,
VVVGGSELTSSPK,ph,S,1453,true,"Phosphorylation nuclei-enriched fractions",28,19245862,,,,,,,,
VVVGGSELTSSPK,ph,S,1453,true,"Large-scale phosphorylation discovery",44,23111157,XCorr,3.2800000,,,,,,
VVVGGSELTSSPK,ph,S,1453,true,"Phosphoproteome ethylene-regulated time response",46,24043427,"MASCOT Score",42.3900000,,,,,,9.6333000
VVVGGSELTSSPK,ph,S,1453,true,"Chloroplast kinase substrates",60,19376835,"MASCOT Score",36.8400000,,,,,,-0.1897440
VVVGGSELTSSPK,ph,S,1453,true,"BSK8 and BSL2 regulating sucrose-ph synthase",66,24924143,"MaxQuant Score",115.5000000,,,,,,0.4148100
VVVGGSELTSSPK,ph,S,1453,true,"srk2dei ABA signaling phopshoproteomics",83,23572148,"MASCOT Score",96.0000000,,,,,,-0.0011000
VVVGGSELTSSPK,ph,S,1453,true,"LAXIC - ABA stress",84a,23660473,XCorr,4.3200000,0.9990000,,,,4.0199999773449E-8,
VVVGGSELTSSPK,ph,S,1453,true,"LAXIC - mannitol vs control",84b,23660473,XCorr,4.4300000,0.9990000,,,,0.00027008401229978,
VVVGGSELTSSPK,ph,S,1453,true,"SnRK2 protein kinase substrates",85,23776212,XCorr,4.4091744,1.0000000,,,,0.0020868699066341,
VVVGGSELTSSPK,ph,S,1453,true,"atm and atr DNA damage response",88,25561503,"MASCOT Score",55.0000000,0.9970000,,,,,-0.0900000
VVVGGSELTSSPK,ph,S,1453,true,"TOR Kinase and ABA Receptor",100,29290610,XCorr,4.3009272,0.9965000,,,,4.4489999595498E-7,
VVVGGSELTSSPK,ph,S,1453,true,"Tissue atlas Arabidopsis - ProteomicsDB",114,32188942,"MaxQuant score",235.6900000,0.9636920,,,,0,
VVVGGSELTSSPK,ph,S,1453,true,"Touch-induced phosphorylation: 40s touch vs untouc",136,30291188,"MASCOT score",92.6700000,,-0.1573187,0.2404430,NO,,4.6573611
AFPIETAVSNARPGK,ph,S,1477,true,"Tissue atlas Arabidopsis - ProteomicsDB",114,32188942,"MaxQuant score",218.7800000,1.0000000,,,,0,
SKSAQMAEDSDTCLLNK,ph,S,1486,true,"atm and atr DNA damage response",88,25561503,"MASCOT Score",60.0000000,0.9260000,,,,,-0.1300000
SAQMAEDSDTCLLNK,ph,S,1486,true,"Tissue atlas Arabidopsis - ProteomicsDB",114,32188942,"MaxQuant score",158.8900000,0.9982810,,,,6.4390200570631E-17,
SAQMAEDSDTCLLNKSPTANDSNGSESVIGVK,ph,S,1501,true,"srk2dei ABA signaling phopshoproteomics",83,23572148,"MASCOT Score",80.0000000,,,,,,-0.0042000
SAQMAEDSDTCLLNKSPTANDSNGSESVIGVK,ph,S,1501,true,"SnRK2 protein kinase substrates",85,23776212,XCorr,5.1080804,0.9670000,,,,2.6965299326775E-8,
SAQMAEDSDTCLLNKSPTANDSNGSESVIGVK,ph,S,1501,true,"Tissue atlas Arabidopsis - ProteomicsDB",114,32188942,"MaxQuant score",403.0900000,0.9966930,,,,0,
SPTANDSNGSESVIGVK,ph,S,1501,true,"srk2dei ABA signaling phopshoproteomics",83,23572148,"MASCOT Score",89.0000000,,,,,,-0.0002000
SPTANDSNGSESVIGVK,ph,S,1501,true,"atm and atr DNA damage response",88,25561503,"MASCOT Score",58.0000000,0.9580000,,,,,-0.1200000
SPTANDSNGSESVIGVK,ph,S,1501,true,"TOR Kinase and ABA Receptor",100,29290610,XCorr,5.1121464,0.9916000,,,,3.4580001084805E-8,
SAQMAEDSDTCLLNKSPTANDSNGSESVIGVK,ph,T,1503,true,"SnRK2 protein kinase substrates",85,23776212,XCorr,4.5655608,0.8150000,,,,2.2723699658056E-11,
SPTANDSNGSESVIGVK,ph,T,1503,true,"srk2dei ABA signaling phopshoproteomics",83,23572148,"MASCOT Score",81.0000000,,,,,,0.0010000
SPTANDSNGSESVIGVK,ph,S,1510,true,"Tissue atlas Arabidopsis - ProteomicsDB",114,32188942,"MaxQuant score",138.4600000,0.8526240,,,,2.5339300102623E-10,
DLCDAELK,ox,C,1523,true,"SPEAR - 50 mM H2O2 / mock",138b,34619326,,,,1.2357608,0.0071630,YES,,
DLCDAELKTVDGETENLPNGDSSPK,ph,T,1529,true,"Tissue atlas Arabidopsis - ProteomicsDB",114,32188942,"MaxQuant score",73.8680000,0.9982960,,,,1.1968199764567E-8,
TVDGETENLPNGDSSPKSSVAADGEK,ph,S,1542,true,"STN8 phosphoproteome",38,21768351,"MASCOT Score",47.1500000,,,,,,-2.0984900
TVDGETENLPNGDSSPKSSVAADGEK,ph,S,1542,true,"LAXIC - mannitol vs control",84b,23660473,XCorr,4.7500000,0.7730000,,,,0.0065014800056815,
TVDGETENLPNGDSSPK,ph,S,1542,true,"Large-scale phosphorylation discovery",44,23111157,XCorr,2.9430000,,,,,,
TVDGETENLPNGDSSPK,ph,S,1542,true,"atm and atr DNA damage response",88,25561503,"MASCOT Score",26.0000000,0.9290000,,,,,1.0200000
TVDGETENLPNGDSSPK,ph,S,1542,true,"Tissue atlas Arabidopsis - ProteomicsDB",114,32188942,"MaxQuant score",338.4200000,0.9100620,,,,0,
TVDGETENLPNGDSSPKSSVAADGEK,ph,S,1543,true,"TOR Kinase and ABA Receptor",100,29290610,XCorr,6.0707755,0.8777000,,,,1.2110000113807E-7,
DLCDAELKTVDGETENLPNGDSSPK,ph,S,1543,true,"SnRK2 protein kinase substrates",85,23776212,XCorr,3.2405536,0.8340000,,,,5.3324299642554E-8,
TVDGETENLPNGDSSPK,ph,S,1543,true,"Phosphorylation nuclei-enriched fractions",28,19245862,,,,,,,,
TVDGETENLPNGDSSPK,ph,S,1543,true,"STN8 phosphoproteome",38,21768351,"MASCOT Score",45.7700000,,,,,,-1.7570800
TVDGETENLPNGDSSPK,ph,S,1543,true,"Large-scale phosphorylation discovery",44,23111157,XCorr,3.1160000,,,,,,
TVDGETENLPNGDSSPK,ph,S,1543,true,"Tyrosine phosphorylation in Arabidopsis",59,18463617,"MASCOT Score",90.0000000,,,,,,-0.7613845
TVDGETENLPNGDSSPK,ph,S,1543,true,"Chloroplast kinase substrates",60,19376835,"MASCOT Score",40.0800000,,,,,,-1.3876700
TVDGETENLPNGDSSPK,ph,S,1543,true,"Conserved plant phosphoproteome - Arabidopsis",61a,20466843,"MASCOT Score",96.0000000,1.0000000,,,,,
TVDGETENLPNGDSSPK,ph,S,1543,true,"srk2dei ABA signaling phopshoproteomics",83,23572148,"MASCOT Score",97.0000000,,,,,,-0.0006000
TVDGETENLPNGDSSPK,ph,S,1543,true,"LAXIC - ABA stress",84a,23660473,XCorr,4.8300000,0.9990000,,,,2.5700000461093E-10,
TVDGETENLPNGDSSPK,ph,S,1543,true,"LAXIC - mannitol vs control",84b,23660473,XCorr,4.8100000,0.9990000,-1.2972614,,NO,0.00099277996923774,
TVDGETENLPNGDSSPK,ph,S,1543,true,"SnRK2 protein kinase substrates",85,23776212,XCorr,4.2280731,0.9990000,,,,0.0002052880008705,
TVDGETENLPNGDSSPK,ph,S,1543,true,"atm and atr DNA damage response",88,25561503,"MASCOT Score",81.0000000,0.9380000,,,,,-0.4400000
TVDGETENLPNGDSSPK,ph,S,1543,true,"TOR Kinase and ABA Receptor",100,29290610,XCorr,4.6336250,0.9246000,,,,1.2370000490591E-7,
TVDGETENLPNGDSSPK,ph,S,1543,true,"Tissue atlas Arabidopsis - ProteomicsDB",114,32188942,"MaxQuant score",341.3000000,0.9207580,,,,0,
TVDGETENLPNGDSSPKSSVAADGEK,ph,S,1546,true,"Tissue atlas Arabidopsis - ProteomicsDB",114,32188942,"MaxQuant score",166.0600000,0.8165860,,,,0,
TVDGETENLPNGDSSPKSSVAADGEK,ph,S,1547,true,"LAXIC - mannitol vs control",84b,23660473,XCorr,4.7500000,0.7740000,,,,0.0065014800056815,
LSASAPPYTPTTIPIFGSIAVPGFK,ph,T,1576,true,"TOR Kinase and ABA Receptor",100,29290610,XCorr,4.3862290,0.7794000,,,,4.7849998736638E-6,
DHGGILPSPLNMPPMLPINHVR,ph,S,1600,true,"Tissue atlas Arabidopsis - ProteomicsDB",114,32188942,"MaxQuant score",53.4750000,1.0000000,,,,0.00042691500857472,
CWGDYSDNEIEQIEVTS,ph,Y,1807,true,"srk2dei ABA signaling phopshoproteomics",83,23572148,"MASCOT Score",29.0000000,,,,,,-0.0003000
CWGDYSDNEIEQIEVTS,ph,S,1808,true,"srk2dei ABA signaling phopshoproteomics",83,23572148,"MASCOT Score",53.0000000,,,,,,-0.0015000
CWGDYSDNEIEQIEVTS,ph,S,1808,true,"LAXIC - ABA stress",84a,23660473,XCorr,3.7700000,0.9840000,,,,0.036752700805664,
CWGDYSDNEIEQIEVTS,ph,S,1808,true,"SnRK2 protein kinase substrates",85,23776212,XCorr,3.2470405,0.9960000,,,,0.0045870500616729,
