Peptide,PTM,ModifiedAA,ModifiedPosition,PeptideUniqueToGene,ExperimentDesc,ExpID,PubmedID,ScoreType,IdentScore,LocProb,Log2FChange,PQ-val,QuantSig,PEP,MassErrorPPM
GSAAELTEPTTGTEKLHQPIEVEEDDEQIVDLER,nt,G,2,true,"HUNTER N-terminome: legumain, GluC and trypsin",119,31951383,"MaxQuant score",89.7930000,,,,,,
GSAAELTEPTTGTEK,nta,G,2,true,"Characterization plant N-terminal acetylation",6,22223895,"MASCOT Score",43.5100000,,,,,,
GSAAELTEPTTGTEK,ph,S,3,true,"atm and atr DNA damage response",88,25561503,"MASCOT Score",56.0000000,1.0000000,,,,,-0.5000000
GSAAELTEPTTGTEK,ph,S,3,true,"Tissue atlas Arabidopsis - ProteomicsDB",114,32188942,"MaxQuant score",170.1100000,1.0000000,,,,8.380569622733E-18,
RPHLTEPLFHSEDNLPSLDGGENSANESFVFK,ph,S,254,true,"TOR Kinase and ABA Receptor",100,29290610,XCorr,5.0394087,0.9797000,,,,1.8920000002254E-6,
KESAIQQGGASSSVLEANPPPR,ph,S,330,true,"Tissue atlas Arabidopsis - ProteomicsDB",114,32188942,"MaxQuant score",69.5760000,0.9954450,,,,4.1038301787921E-6,
ESAIQQGGASSSVLEANPPPR,ph,S,338,true,"Tissue atlas Arabidopsis - ProteomicsDB",114,32188942,"MaxQuant score",200.8900000,0.9085530,,,,0,
ESAIQQGGASSSVLEANPPPR,ph,S,340,true,"Tissue atlas Arabidopsis - ProteomicsDB",114,32188942,"MaxQuant score",333.3200000,0.9893610,,,,0,
GNLSPMRK,ph,S,364,true,"atm and atr DNA damage response",88,25561503,"MASCOT Score",24.0000000,1.0000000,,,,,-1.7500000
GNLSPMRK,ph,S,364,true,"TOR Kinase and ABA Receptor",100,29290610,XCorr,2.2696805,1.0000000,,,,0.01465000025928,
GNLSPMRK,ph,S,364,true,"Tissue atlas Arabidopsis - ProteomicsDB",114,32188942,"MaxQuant score",119.8600000,1.0000000,,,,0.0028833700343966,
GRLSPIQPSHGMSILNTVTNGPDGLK,ph,S,441,true,"TOR Kinase and ABA Receptor",100,29290610,XCorr,5.5219789,0.9998000,,,,2.0330000793933E-8,
GRLSPIQPSHGMSILNTVTNGPDGLK,ph,S,441,true,"Tissue atlas Arabidopsis - ProteomicsDB",114,32188942,"MaxQuant score",263.0900000,1.0000000,,,,0,
VETTIHEEGAPLLFEGKDTPDTSTADFGLTK,ph,T,482,true,"Tissue atlas Arabidopsis - ProteomicsDB",114,32188942,"MaxQuant score",129.5600000,0.9751720,,,,1.4012984643248E-45,
GVITGPANPEIDISAGNLLEEGSLR,ph,S,518,true,"Touch-induced phosphorylation: 40s touch vs untouc",136,30291188,"MASCOT score",118.8800000,,-0.0787719,0.7360073,NO,,5.0268704
