Peptide,PTM,ModifiedAA,ModifiedPosition,PeptideUniqueToGene,ExperimentDesc,ExpID,PubmedID,ScoreType,IdentScore,LocProb,Log2FChange,PQ-val,QuantSig,PEP,MassErrorPPM
SAIAIDAPSSLTGVTPIR,nt,S,42,true,"N-terminal ChaFRADIC",92,26010716,"MASCOT Score",55.8700000,,,,,2.0719999938024E-8,
SAIAIDAPSSLTGVTPIR,nt,S,42,true,"HUNTER N-terminome: legumain, GluC and trypsin",119,31951383,"MaxQuant score",70.3340000,,,,,,
SAIAIDAPSSLTGVTPIR,nta,S,42,true,"HUNTER N-terminome: legumain, GluC and trypsin",119,31951383,"MaxQuant score",68.8300000,,,,,,
AIAIDAPSSLTGVTPIR,nt,A,43,true,"HUNTER N-terminome: legumain, GluC and trypsin",119,31951383,"MaxQuant score",91.8580000,,,,,,
AIAIDAPSSLTGVTPIR,nta,A,43,true,"HUNTER N-terminome: legumain, GluC and trypsin",119,31951383,"MaxQuant score",150.6800000,,,,,,
IAIDAPSSLTGVTPIR,nta,I,44,true,"HUNTER N-terminome: legumain, GluC and trypsin",119,31951383,"MaxQuant score",132.5900000,,,,,,
IDAPSSLTGVTPIR,nta,I,46,true,"HUNTER N-terminome: legumain, GluC and trypsin",119,31951383,"MaxQuant score",45.8790000,,,,,,
AAIQEVKR,ac,K,212,true,"Quantitative Acetylproteomics",101,29440448,,,,,,,,
