Peptide,PTM,ModifiedAA,ModifiedPosition,PeptideUniqueToGene,ExperimentDesc,ExpID,PubmedID,ScoreType,IdentScore,LocProb,Log2FChange,PQ-val,QuantSig,PEP,MassErrorPPM
FTSAGYPSNSFQLTPPTNWGIR,nt,F,43,true,"HUNTER N-terminome: legumain, GluC and trypsin",119,31951383,"MaxQuant score",57.4840000,,,,,,
TSAGYPSNSFQLTPPTNWGIR,nt,T,44,true,"HUNTER N-terminome: legumain, GluC and trypsin",119,31951383,"MaxQuant score",41.6150000,,,,,,
DWGLQCLR,ox,C,197,false,"Redox kickstart of mitochondria",112,31871212,,,,-1.4443026,0.0187207,YES,,
QSHINIADGKK,ac,K,246,true,"Quantitative Acetylproteomics",101,29440448,,,,,,,,
AQATAKGLVLLSQSLK,cr,K,281,true,"Open search Plant PTM Viewer 2.0 - Crotonylation",164c,TBA,,,,,,,,
SLVINGPSKDHQETQALDETDLEELEDMGEK,ph,T,362,true,"STN8 phosphoproteome",38,21768351,"MASCOT Score",58.7600000,,,,,,
SLVINGPSKDHQETQALDETDLEELEDMGEK,ph,T,362,true,"Chloroplast kinase substrates",60,19376835,"MASCOT Score",59.3600000,,,,,,-0.4351880
SLVINGPSKDHQETQALDETDLEELEDMGEK,ph,T,362,true,"Col-0 callus - FC Col-0 vs. Col-0 Xray",111a,31410901,,70.5800000,,1.2011220,0.0000000,NO,,0.9112395
SLVINGPSKDHQETQALDETDLEELEDMGEK,ph,T,362,true,"Col-0 X-ray callus - FC Col-0 vs. Col-0 Xray",111b,31410901,,70.5800000,,1.2011220,0.0000000,NO,,0.9112395
SLVINGPSKDHQETQALDETDLEELEDMGEK,ph,T,362,true,"atm callus - FC atm vs. atm Xray",111c,31410901,,70.5800000,,1.6047956,0.0000000,NO,,0.9112395
SLVINGPSKDHQETQALDETDLEELEDMGEK,ph,T,362,true,"atm-3 X-ray callus - FC atm vs. atm Xray",111d,31410901,,70.5800000,,1.6047956,0.0000000,NO,,0.9112395
SLVINGPSKDHQETQALDETDLEELEDMGEK,ph,T,362,true,"Tissue atlas Arabidopsis - ProteomicsDB",114,32188942,"MaxQuant score",306.9500000,1.0000000,,,,0,
DHQETQALDETDLEELEDMGEK,ph,T,362,true,"Arabidopsis root NAA phosphoproteome",18a,27643528,"MaxQuant Score",92.0100000,1.0000000,,,,2.8190000247313E-12,0.0950000
DHQETQALDETDLEELEDMGEK,ph,T,362,true,"Mitochondrial phosphoproteome",32,19688752,"MASCOT Score",53.6100000,,,,,,3.1103100
DHQETQALDETDLEELEDMGEK,ph,T,362,true,"Large-scale phosphorylation discovery",44,23111157,XCorr,6.7380000,,,,,,
DHQETQALDETDLEELEDMGEK,ph,T,362,true,"PAMP-triggered phosphorylation",48,24601666,"MASCOT Score",20.8900000,,,,,,
DHQETQALDETDLEELEDMGEK,ph,T,362,true,"BSK8 and BSL2 regulating sucrose-ph synthase",66,24924143,"MaxQuant Score",95.6220000,,,,,,0.2268200
DHQETQALDETDLEELEDMGEK,ph,T,362,true,"srk2dei ABA signaling phopshoproteomics",83,23572148,"MASCOT Score",88.0000000,,,,,,-0.0008000
DHQETQALDETDLEELEDMGEK,ph,T,362,true,"SnRK2 protein kinase substrates",85,23776212,XCorr,4.0006270,1.0000000,,,,3.2715898810572E-14,
DHQETQALDETDLEELEDMGEK,ph,T,362,true,"Brassinosteroid-Regulated Phosphorylation Dynamics",94,26187819,"MaxQuant Score",189.3400000,0.9990000,,,,0,0.9420000
DHQETQALDETDLEELEDMGEK,ph,T,362,true,"TOR Kinase and ABA Receptor",100,29290610,XCorr,7.3169074,1.0000000,,,,1.1779999908867E-7,
DHQETQALDETDLEELEDMGEK,ph,T,362,true,"Lateral root-induction - NAA vs control",106,23328941,"MASCOT Score",66.0000000,,-0.0437057,0.7661173,NO,,
DHQETQALDETDLEELEDMGEK,ph,T,362,true,"Phospho cell culture sucrose/TOR",109,30833711,,,1.0000000,,,,,
DHQETQALDETDLEELEDMGEK,ph,T,362,true,"Col-0 callus - FC Col-0 vs. Col-0 Xray",111a,31410901,,57.7500000,,0.6634964,0.0000000,NO,,0.8593010
DHQETQALDETDLEELEDMGEK,ph,T,362,true,"Col-0 X-ray callus - FC Col-0 vs. Col-0 Xray",111b,31410901,,57.7500000,,0.6634964,0.0000000,NO,,0.8593010
DHQETQALDETDLEELEDMGEK,ph,T,362,true,"atm callus - FC atm vs. atm Xray",111c,31410901,,57.7500000,,1.3163843,0.0000000,NO,,0.8593010
DHQETQALDETDLEELEDMGEK,ph,T,362,true,"atm-3 X-ray callus - FC atm vs. atm Xray",111d,31410901,,57.7500000,,1.3163843,0.0000000,NO,,0.8593010
SGSISFDTEKPGHTGEPR,nt,S,383,true,"Arabidopsis translation initiation landscape - NT",167b,35069635,,,,,,,,
SGSISFDTEKPGHTGEPR,ph,S,385,true,"Tissue atlas Arabidopsis - ProteomicsDB",114,32188942,"MaxQuant score",71.6960000,0.9724890,,,,0.00011168699711561,
