Peptide,PTM,ModifiedAA,ModifiedPosition,PeptideUniqueToGene,ExperimentDesc,ExpID,PubmedID,ScoreType,IdentScore,LocProb,Log2FChange,PQ-val,QuantSig,PEP,MassErrorPPM
GVEVVNSGGFE,nt,G,2,true,"N-terminal ChaFRADIC",92,26010716,"MASCOT Score",68.5400000,,,,,4.3720001485781E-6,
GVEVVNSGGFEVAPAPFEGKPEK,ph,S,8,true,"Tissue atlas Arabidopsis - ProteomicsDB",114,32188942,"MaxQuant score",267.8100000,1.0000000,,,,0,
LDQGKGDDAPINFGSVGELPK,ph,S,42,true,"Tissue atlas Arabidopsis - ProteomicsDB",114,32188942,"MaxQuant score",219.1600000,1.0000000,,,,0,
GDDAPINFGSVGELPK,ph,S,42,true,"srk2dei ABA signaling phopshoproteomics",83,23572148,"MASCOT Score",27.0000000,,,,,,0.0007000
GDDAPINFGSVGELPK,ph,S,42,true,"TOR Kinase and ABA Receptor",100,29290610,XCorr,4.0509520,1.0000000,,,,8.6020001617726E-5,
VVNSDAPK,ph,S,60,true,"Tissue atlas Arabidopsis - ProteomicsDB",114,32188942,"MaxQuant score",84.0540000,1.0000000,,,,0.0079335300251842,
VVNSDAPKNAAEEWPVAK,ac,K,64,true,"Quantitative Acetylproteomics",101,29440448,,,,,,,,
KGFNTMFDEKR,ac,K,148,true,"Quantitative Acetylproteomics",101,29440448,,,,,,,,
LRSNDGGSAR,ph,S,164,true,"atm and atr DNA damage response",88,25561503,"MASCOT Score",25.0000000,0.9900000,,,,,-0.1500000
SIPLTEE,nt,S,197,true,"N-terminal ChaFRADIC",92,26010716,"MASCOT Score",38.9600000,,,,,0.0081590004265308,
IQHESIPLTEEK,ph,S,197,true,"Large-scale phosphorylation discovery",44,23111157,XCorr,3.7060000,,,,,,
IQHESIPLTEEK,ph,S,197,true,"Tissue atlas Arabidopsis - ProteomicsDB",114,32188942,"MaxQuant score",209.6000000,0.9999990,,,,3.8805499442961E-31,
IQHESIPLTEEK,ph,T,201,true,"Tissue atlas Arabidopsis - ProteomicsDB",114,32188942,"MaxQuant score",76.1960000,0.9988600,,,,0.0060769701376557,
DKVIANAAMR,ub,K,219,true,"Arabidopsis ubiquitination COFRADIC",40,26744219,"MaxQuant Score",70.9420000,1.0000000,,,,0.00027469999622554,-0.9240000
IKESMGQKDDIQGQVK,ph,S,233,true,"Tissue atlas Arabidopsis - ProteomicsDB",114,32188942,"MaxQuant score",141.8900000,1.0000000,,,,0.00012405200686771,
INELSEKLK,ub,K,271,true,"Ubiquitination Membrane Proteins",120,33585938,,,,,,,,
DKAYSNIHDLR,ub,K,295,true,"Arabidopsis ubiquitination COFRADIC",40,26744219,"MaxQuant Score",63.0910000,1.0000000,,,,0.0020000000949949,-0.0540000
NFREDYEKR,ac,K,363,true,"Quantitative Acetylproteomics",101,29440448,,,,,,,,
ILQSLDSR,ph,S,371,true,"Tissue atlas Arabidopsis - ProteomicsDB",114,32188942,"MaxQuant score",129.8900000,0.9998940,,,,0.0029474201146513,
ATPSETEVVPK,ph,T,399,true,"Tissue atlas Arabidopsis - ProteomicsDB",114,32188942,"MaxQuant score",99.6040000,0.9792440,,,,8.4313599962606E-22,
ATPSETEVVPK,ph,S,401,true,"Tissue atlas Arabidopsis - ProteomicsDB",114,32188942,"MaxQuant score",88.8030000,0.9691920,,,,0.0004919630009681,
ATPSETEVVPK,ph,T,403,true,"Tissue atlas Arabidopsis - ProteomicsDB",114,32188942,"MaxQuant score",89.1890000,0.9885790,,,,0.0012884100433439,
EEPVSAPKPDATVAQNTEK,ph,S,421,true,"Pollen phosphoproteome Arabidopsis",43,22631563,"MASCOT Score",41.0700000,,,,,,-1.7410200
EEPVSAPKPDATVAQNTEK,ph,S,421,true,"Tissue atlas Arabidopsis - ProteomicsDB",114,32188942,"MaxQuant score",287.3100000,1.0000000,,,,0,
EEPVSAPKPDATVAQNTEK,ph,T,428,true,"Tissue atlas Arabidopsis - ProteomicsDB",114,32188942,"MaxQuant score",71.6370000,0.9912900,,,,0.00027011201018468,
EEPVSAPKPDATVAQNTEK,ph,T,433,true,"Tissue atlas Arabidopsis - ProteomicsDB",114,32188942,"MaxQuant score",132.0100000,0.9999960,,,,2.2317600377334E-14,
EEPVSAPKPDATVAQNTEKAK,ac,K,435,true,"Quantitative Acetylproteomics",101,29440448,,,,,,,,
VKNVADDDDDEVYGLGKPQKEEKPVDAATAK,ac,K,443,true,"Quantitative Acetylproteomics",101,29440448,,,,,,,,
TGGNTETETEEVPEASEEEIEAPVQEEKPQK,ph,T,529,true,"Plasmamembrane phosphorylation",20,15308754,,,,,,,,
TGGNTETETEEVPEASEEEIEAPVQEEKPQK,ph,T,529,true,"Tissue atlas Arabidopsis - ProteomicsDB",114,32188942,"MaxQuant score",245.0800000,0.9969610,,,,0,
TGGNTETETEEVPEASEEEIEAPVQEEKPQK,ph,T,531,true,"Large-scale phosphorylation discovery",44,23111157,XCorr,4.4240000,,,,,,
TGGNTETETEEVPEASEEEIEAPVQEEKPQK,ph,T,531,true,"Phospho cell culture sucrose/TOR",109,30833711,,,0.7794940,,,,,
TGGNTETETEEVPEASEEEIEAPVQEEKPQK,ph,T,531,true,"Col-0 callus - FC Col-0 vs. Col-0 Xray",111a,31410901,,28.9800000,,-1.3937156,0.0000000,NO,,3.5522274
TGGNTETETEEVPEASEEEIEAPVQEEKPQK,ph,T,531,true,"Col-0 X-ray callus - FC Col-0 vs. Col-0 Xray",111b,31410901,,28.9800000,,-1.3937156,0.0000000,NO,,3.5522274
TGGNTETETEEVPEASEEEIEAPVQEEKPQK,ph,T,531,true,"atm callus - FC atm vs. atm Xray",111c,31410901,,28.9800000,,-3.2707014,0.0000000,NO,,3.5522274
TGGNTETETEEVPEASEEEIEAPVQEEKPQK,ph,T,531,true,"atm-3 X-ray callus - FC atm vs. atm Xray",111d,31410901,,28.9800000,,-3.2707014,0.0000000,NO,,3.5522274
TGGNTETETEEVPEASEEEIEAPVQEEKPQK,ph,T,531,true,"Tissue atlas Arabidopsis - ProteomicsDB",114,32188942,"MaxQuant score",217.3900000,0.9996820,,,,0,
KTGGNTETETEEVPEASEEEIEAPVQEEKPQKEK,ph,S,540,true,"STN8 phosphoproteome",38,21768351,"MASCOT Score",98.5800000,,,,,,-0.9744170
KTGGNTETETEEVPEASEEEIEAPVQEEKPQKEK,ph,S,540,true,"Chloroplast kinase substrates",60,19376835,"MASCOT Score",89.9800000,,,,,,-1.1495500
TGGNTETETEEVPEASEEEIEAPVQEEKPQKEK,ph,S,540,true,"STN8 phosphoproteome",38,21768351,"MASCOT Score",108.1200000,,,,,,-0.8806190
TGGNTETETEEVPEASEEEIEAPVQEEKPQKEK,ph,S,540,true,"Chloroplast kinase substrates",60,19376835,"MASCOT Score",62.5700000,,,,,,-1.3280600
TGGNTETETEEVPEASEEEIEAPVQEEKPQKEK,ph,S,540,true,"SnRK2 protein kinase substrates",85,23776212,XCorr,2.3884375,0.9590000,,,,0.065406501293182,
KKTGGNTETETEEVPEASEEEIEAPVQEEKPQK,ph,S,540,true,"STN8 phosphoproteome",38,21768351,"MASCOT Score",95.4300000,,,,,,-1.4536000
KKTGGNTETETEEVPEASEEEIEAPVQEEKPQK,ph,S,540,true,"Chloroplast kinase substrates",60,19376835,"MASCOT Score",75.4000000,,,,,,0.0915236
KKTGGNTETETEEVPEASEEEIEAPVQEEKPQK,ph,S,540,true,"SnRK2 protein kinase substrates",85,23776212,XCorr,4.6366553,0.9490000,,,,0.0038671700749546,
KKTGGNTETETEEVPEASEEEIEAPVQEEKPQK,ph,S,540,true,"Touch-induced phosphorylation: 40s touch vs untouc",136,30291188,"MASCOT score",49.8600000,,-0.0807186,0.6118080,NO,,-1.4492853
KTGGNTETETEEVPEASEEEIEAPVQEEKPQK,ph,S,540,true,"Mitochondrial phosphoproteome",32,19688752,"MASCOT Score",39.8200000,,,,,,1.2702200
KTGGNTETETEEVPEASEEEIEAPVQEEKPQK,ph,S,540,true,"ABA-induced protein phosphorylation",35,20733066,,,,,,,,
KTGGNTETETEEVPEASEEEIEAPVQEEKPQK,ph,S,540,true,"LAXIC - ABA stress",84a,23660473,XCorr,6.9200000,0.9560000,,,,1.2799999637991E-7,
KTGGNTETETEEVPEASEEEIEAPVQEEKPQK,ph,S,540,true,"LAXIC - mannitol vs control",84b,23660473,XCorr,5.9600000,0.9880000,,,,0.0020592301152647,
KTGGNTETETEEVPEASEEEIEAPVQEEKPQK,ph,S,540,true,"SnRK2 protein kinase substrates",85,23776212,XCorr,5.4117150,0.9990000,,,,8.951849678196E-11,
KTGGNTETETEEVPEASEEEIEAPVQEEKPQK,ph,S,540,true,"Col-0 callus - FC Col-0 vs. Col-0 Xray",111a,31410901,,50.5400000,,-0.6052292,0.0000000,NO,,1.4014395
KTGGNTETETEEVPEASEEEIEAPVQEEKPQK,ph,S,540,true,"Col-0 X-ray callus - FC Col-0 vs. Col-0 Xray",111b,31410901,,50.5400000,,-0.6052292,0.0000000,NO,,1.4014395
KTGGNTETETEEVPEASEEEIEAPVQEEKPQK,ph,S,540,true,"atm callus - FC atm vs. atm Xray",111c,31410901,,50.5400000,,-0.7309177,0.0000000,NO,,1.4014395
KTGGNTETETEEVPEASEEEIEAPVQEEKPQK,ph,S,540,true,"atm-3 X-ray callus - FC atm vs. atm Xray",111d,31410901,,50.5400000,,-0.7309177,0.0000000,NO,,1.4014395
TGGNTETETEEVPEASEEEIEAPVQEEKPQK,ph,S,540,true,"Arabidopsis root NAA phosphoproteome",18a,27643528,"MaxQuant Score",152.1000000,1.0000000,,,,1.2199999846549E-35,0.1590000
TGGNTETETEEVPEASEEEIEAPVQEEKPQK,ph,S,540,true,"Phosphorylation Early Elicitor Signaling",23,17317660,,,,,,,,
TGGNTETETEEVPEASEEEIEAPVQEEKPQK,ph,S,540,true,"Mitochondrial phosphoproteome",32,19688752,"MASCOT Score",49.6000000,,,,,,10.8224000
TGGNTETETEEVPEASEEEIEAPVQEEKPQK,ph,S,540,true,"Phytohormone-responsive phosphoproteins",34,20374526,"MASCOT Score",64.0000000,,,,,,4.1820900
TGGNTETETEEVPEASEEEIEAPVQEEKPQK,ph,S,540,true,"STN8 phosphoproteome",38,21768351,"MASCOT Score",129.3800000,,,,,,-1.8758300
TGGNTETETEEVPEASEEEIEAPVQEEKPQK,ph,S,540,true,"Phosphoproteomic analysis of seed maturation",42,22440515,"MASCOT Score",97.0000000,,,,,,-2.5800000
TGGNTETETEEVPEASEEEIEAPVQEEKPQK,ph,S,540,true,"PAMP-triggered phosphorylation",48,24601666,"MASCOT Score",80.3800000,,,,,,
TGGNTETETEEVPEASEEEIEAPVQEEKPQK,ph,S,540,true,"Chloroplast kinase substrates",60,19376835,"MASCOT Score",80.1600000,,,,,,0.8014850
TGGNTETETEEVPEASEEEIEAPVQEEKPQK,ph,S,540,true,"Conserved plant phosphoproteome - Arabidopsis",61a,20466843,"MASCOT Score",79.0000000,1.0000000,,,,,
TGGNTETETEEVPEASEEEIEAPVQEEKPQK,ph,S,540,true,"srk2dei ABA signaling phopshoproteomics",83,23572148,"MASCOT Score",112.0000000,,,,,,-0.0025000
TGGNTETETEEVPEASEEEIEAPVQEEKPQK,ph,S,540,true,"LAXIC - ABA stress",84a,23660473,XCorr,5.9600000,0.8790000,,,,8.5999998233888E-9,
TGGNTETETEEVPEASEEEIEAPVQEEKPQK,ph,S,540,true,"LAXIC - mannitol vs control",84b,23660473,XCorr,6.2300000,0.9860000,-1.3513203,,NO,5.550000216009E-16,
TGGNTETETEEVPEASEEEIEAPVQEEKPQK,ph,S,540,true,"SnRK2 protein kinase substrates",85,23776212,XCorr,6.0262733,0.9990000,,,,4.1599699157746E-16,
TGGNTETETEEVPEASEEEIEAPVQEEKPQK,ph,S,540,true,"Brassinosteroid-Regulated Phosphorylation Dynamics",94,26187819,"MaxQuant Score",119.7500000,1.0000000,,,,8.0839997781794E-14,2.3600000
TGGNTETETEEVPEASEEEIEAPVQEEKPQK,ph,S,540,true,"TOR Kinase and ABA Receptor",100,29290610,XCorr,5.4629564,1.0000000,,,,1.2990000186619E-6,
TGGNTETETEEVPEASEEEIEAPVQEEKPQK,ph,S,540,true,"Lateral root-induction - NAA vs control",106,23328941,"MASCOT Score",74.0000000,,-0.1883121,0.3358277,NO,,
TGGNTETETEEVPEASEEEIEAPVQEEKPQK,ph,S,540,true,"Phospho cell culture sucrose/TOR",109,30833711,,,1.0000000,,,,,
TGGNTETETEEVPEASEEEIEAPVQEEKPQK,ph,S,540,true,"Col-0 callus - FC Col-0 vs. Col-0 Xray",111a,31410901,,60.1700000,,-0.8111224,0.0000000,NO,,1.0105471
TGGNTETETEEVPEASEEEIEAPVQEEKPQK,ph,S,540,true,"Col-0 X-ray callus - FC Col-0 vs. Col-0 Xray",111b,31410901,,60.1700000,,-0.8111224,0.0000000,NO,,1.0105471
TGGNTETETEEVPEASEEEIEAPVQEEKPQK,ph,S,540,true,"atm callus - FC atm vs. atm Xray",111c,31410901,,60.1700000,,-0.7381110,0.0000000,NO,,1.0105471
TGGNTETETEEVPEASEEEIEAPVQEEKPQK,ph,S,540,true,"atm-3 X-ray callus - FC atm vs. atm Xray",111d,31410901,,60.1700000,,-0.7381110,0.0000000,NO,,1.0105471
TGGNTETETEEVPEASEEEIEAPVQEEKPQK,ph,S,540,true,"Tissue atlas Arabidopsis - ProteomicsDB",114,32188942,"MaxQuant score",361.0400000,1.0000000,,,,0,
