Peptide,PTM,ModifiedAA,ModifiedPosition,PeptideUniqueToGene,ExperimentDesc,ExpID,PubmedID,ScoreType,IdentScore,LocProb,Log2FChange,PQ-val,QuantSig,PEP,MassErrorPPM
IRAQTAATSSPTVTKSVD,nt,I,64,true,"HUNTER N-terminome: legumain, GluC and trypsin",119,31951383,"MaxQuant score",63.4430000,,,,,,
QTAATSSPTVTKSVDGKKTLR,nt,Q,67,true,"FtsH12 N-terminome: WT / FtsH12 knockdown miRNA",118,33216923,"MaxQuant score",57.3900000,,-0.7113767,0.0324743,YES,0.0018888999475166,
QTAATSSPTVTKSVDGKKTLR,nt,Q,67,true,"HUNTER N-terminome: legumain, GluC and trypsin",119,31951383,"MaxQuant score",137.4300000,,,,,,
QTAATSSPTVTKSVD,nt,Q,67,true,"HUNTER N-terminome: legumain, GluC and trypsin",119,31951383,"MaxQuant score",87.6180000,,,,,,
QTAATSSPTVTKSVDGKKTLR,nta,Q,67,true,"HUNTER N-terminome: legumain, GluC and trypsin",119,31951383,"MaxQuant score",85.5100000,,,,,,
QTAATSSPTVTKSVD,nta,Q,67,true,"HUNTER N-terminome: legumain, GluC and trypsin",119,31951383,"MaxQuant score",89.4030000,,,,,,
TAATSSPTVTKSVDGKKTLR,nt,T,68,true,"Stromal N-terminome",96,26371235,"MASCOT Score",34.1400000,,,,,,
TAATSSPTVTKSVDGKKTLR,nt,T,68,true,"FtsH12 N-terminome: WT / FtsH12 knockdown miRNA",118,33216923,"MaxQuant score",155.4200000,,0.3787637,0.0533133,NO,0,
TAATSSPTVTKSVDGKKTLR,nta,T,68,true,"Stromal N-terminome",96,26371235,"MASCOT Score",34.1400000,,,,,,
TAATSSPTVTKSVDGKKTLR,nta,T,68,true,"FtsH12 N-terminome: WT / FtsH12 knockdown miRNA",118,33216923,"MaxQuant score",73.4480000,,-0.1634523,0.3288718,NO,0,
TAATSSPTVTKSVDGKKTLR,nta,T,68,true,"HUNTER N-terminome: legumain, GluC and trypsin",119,31951383,"MaxQuant score",161.9500000,,,,,,
TAATSSPTVTKSVD,nta,T,68,true,"HUNTER N-terminome: legumain, GluC and trypsin",119,31951383,"MaxQuant score",98.8980000,,,,,,
TAATSSPTVTK,nta,T,68,true,"Characterization plant N-terminal acetylation",6,22223895,"MASCOT Score",67.6500000,,,,,,
NLAIRAQTAATSSPTVTKSVDGK,ub,K,78,true,"Protein ubiquitination during photomorphogenesis",3,28461270,,,,,,,,
SVDGKKTLR,nt,S,79,true,"Metacaspase9 substrates - 35S:MC9 / mc9",51b,23964026,"MASCOT Score",51.0000000,,1.7721439,,NO,,-0.0824601
WNVIMACR,acy,C,120,true,"Arabidopsis S-acylation atlas - Meristem",163a,35681017,,,,,,,,
ALAETGKWNVIMACR,ox,C,120,true,"SPEAR - 10 mM H2O2 / mock",138a,34619326,,,,-3.0409338,0.0118690,YES,,
WNVIMACR,so,C,120,true,"Arabidopsis S-sulfenylation chemoproteomics",108,31578252,"pFind PSM Score",0.1048350,,1.0638300,,,,-1.3332357
DFLKAER,ac,K,125,false,"Quantitative Acetylproteomics",101,29440448,,,,,,,,
AAKSVGMPK,ac,K,131,true,"Quantitative Acetylproteomics",101,29440448,,,,,,,,
HLDLASLDSVR,nt,H,144,false,"Arg/N-end rule seed, prt6 vs. Wt",99,29168982,"MASCOT Score",59.3700000,,,,,0.0022289999760687,-0.2598771
TETPLDVLVCNAAVYFPTAK,sno,C,172,true,"hot5-4 / wildtype, FAT-switch S-nitrosoproteome",169,37277371,,,,0.9549997,0.0005011,YES,,
NAAVYFPTAKEPTYSAE,nt,N,173,true,"Arg/N-end rule seed, prt6 vs. Wt",99,29168982,"MASCOT Score",41.6600000,,-1.2977267,0.0262705,YES,3.3639999230672E-8,0.3256682
AAVYFPTAKEPTYSAE,nt,A,174,true,"Arg/N-end rule seed, prt6 vs. Wt",99,29168982,"MASCOT Score",29.2400000,,-0.5194382,0.0676660,NO,6.3690000388306E-5,-2.7778453
AKEPTYSAE,nt,A,181,true,"Arg/N-end rule seed, prt6 vs. Wt",99,29168982,"MASCOT Score",23.0600000,,-1.7842369,0.0209033,YES,0.023450000211596,-1.8778529
LLLDDLKK,ac,K,214,false,"Histone deacetylases - apicidin vs control",98a,29061669,"MaxQuant Score",115.7000000,1.0000000,0.0560000,0.7516229,NO,0.0070000002160668,
LLLDDLKK,ac,K,214,false,"Histone deacetylases substrates - TSA vs control",98b,29061669,"MaxQuant Score",115.7000000,1.0000000,-0.0780000,0.9977001,NO,0.0070000002160668,
KSDYPSKR,ac,K,221,false,"Quantitative Acetylproteomics",101,29440448,,,,,,,,
SDYPSKR,ac,K,221,false,"Quantitative Acetylproteomics",101,29440448,,,,,,,,
NMLTMQE,nt,N,283,false,"Arg/N-end rule seed, prt6 vs. Wt",99,29168982,"MASCOT Score",53.0500000,,,,,0.035130001604557,-0.4347879
IASTGLFRE,nt,I,310,true,"Arg/N-end rule seed, prt6 vs. Wt",99,29168982,"MASCOT Score",36.7800000,,-1.4015358,0.0002212,YES,0.00010650000331225,-1.0694827
IASTGLFR,nt,I,310,true,"Arg/N-end rule seed, prt6 vs. Wt",99,29168982,"MASCOT Score",40.3500000,,-1.1616145,0.0003865,YES,0.10589999705553,0.1414066
ALFPPFQKY,nt,A,325,true,"Arg/N-end rule seed, prt6 vs. Wt",99,29168982,"MASCOT Score",21.2800000,,-1.7184875,0.0000489,YES,0.12559999525547,-0.4527109
ALFPPFQKYITK,ac,K,332,true,"Histone deacetylases - hda14 vs WT (thylakoids)",98d,29061669,"MaxQuant Score",83.2000000,1.0000000,0.2610000,0.8394600,NO,0.00040300001273863,
YITKGYVSETESGKR,ac,K,336,true,"Histone deacetylases- hda14 vs WT (low light)",98c,29061669,"MaxQuant Score",162.4600000,1.0000000,3.9410000,0.2365920,NO,3.0999999789394E-10,
YITKGYVSETESGKR,ac,K,336,true,"Histone deacetylases - hda14 vs WT (thylakoids)",98d,29061669,"MaxQuant Score",85.5000000,1.0000000,0.0680000,0.9862795,NO,1.9799999506631E-7,
GYVSETESGKR,nt,G,337,true,"Metacaspase9 substrates - Col-0 / mc9",51a,23964026,"MASCOT Score",63.0000000,,2.1057613,,NO,,-0.5148234
GYVSETESGKR,nt,G,337,true,"Metacaspase9 substrates - 35S:MC9 / mc9",51b,23964026,"MASCOT Score",65.0000000,,3.8872478,,NO,,-1.0296463
GYVSETESGKR,ph,Y,338,true,"Tissue atlas Arabidopsis - ProteomicsDB",114,32188942,"MaxQuant score",131.5000000,1.0000000,,,,1.5674400856369E-5,
GYVSETESGKR,ph,S,340,true,"atm and atr DNA damage response",88,25561503,"MASCOT Score",46.0000000,1.0000000,,,,,-0.1400000
GYVSETESGKR,ph,S,340,true,"Tissue atlas Arabidopsis - ProteomicsDB",114,32188942,"MaxQuant score",105.3600000,0.9980090,,,,3.6277600884205E-5,
GYVSETESGK,ph,S,340,true,"atm and atr DNA damage response",88,25561503,"MASCOT Score",42.0000000,0.9370000,,,,,-0.9000000
YITKGYVSETESGKR,ac,K,346,true,"Quantitative Acetylproteomics",101,29440448,,,,,,,,
GYVSETESGKR,ac,K,346,true,"Quantitative Acetylproteomics",101,29440448,,,,,,,,
NASASFENQLSEEASDVEKAR,nt,N,368,true,"Arg/N-end rule seed, prt6 vs. Wt",99,29168982,"MASCOT Score",38.6400000,,,,,0.015850000083447,-1.6053958
NASASFENQLSEEASDVEKAR,nta,N,368,true,"Arg/N-end rule seed, prt6 vs. Wt",99,29168982,"MASCOT Score",38.6400000,,,,,0.015850000083447,-1.6053958
