Peptide,PTM,ModifiedAA,ModifiedPosition,PeptideUniqueToGene,ExperimentDesc,ExpID,PubmedID,ScoreType,IdentScore,LocProb,Log2FChange,PQ-val,QuantSig,PEP,MassErrorPPM
MNPDSDYPHLPN,nta,M,1,true,"Arg/N-end rule seed, prt6 vs. Wt",99,29168982,"MASCOT Score",33.2000000,,,,,0.13269999623299,-1.8108713
MNPDSDYPHL,nta,M,1,true,"N-term acetylation drought responses",5,26184543,,,,,,,,
MNPDSDYPHLPNIK,ph,S,5,true,"Tissue atlas Arabidopsis - ProteomicsDB",114,32188942,"MaxQuant score",61.1860000,0.9436330,,,,0.00061514001572505,
IHHPSSPRHSHHHSSSTPSAATPTPTAGAR,ph,S,19,true,"MAPK Arabidopsis substrates",45,23172892,"MaxQuant Score",49.8710000,,,,,,
IHHPSSPRHSHHHSSSTPSAATPTPTAGAR,ph,S,19,true,"Brassinosteroid-Regulated Phosphorylation Dynamics",94,26187819,"MaxQuant Score",65.2720000,0.7640000,,,,0.0080000003799796,-0.9460000
IHHPSSPR,ph,S,19,true,"MAPK Arabidopsis substrates",45,23172892,"MaxQuant Score",89.6980000,,,,,,
IHHPSSPR,ph,S,19,true,"Chloroplast kinase substrates",60,19376835,"MASCOT Score",31.9500000,,,,,,0.5215820
IHHPSSPR,ph,S,19,true,"Phospho cell culture sucrose/TOR",109,30833711,,,0.8490570,,,,,
IHHPSSPR,ph,S,19,true,"Tissue atlas Arabidopsis - ProteomicsDB",114,32188942,"MaxQuant score",132.0100000,0.8644860,,,,0.00074485602090135,
IHHPSSPR,ph,S,20,true,"MAPK Arabidopsis substrates",45,23172892,"MaxQuant Score",91.0690000,,,,,,
IHHPSSPR,ph,S,20,true,"Chloroplast kinase substrates",60,19376835,"MASCOT Score",31.6800000,,,,,,-1.2562500
IHHPSSPR,ph,S,20,true,"srk2dei ABA signaling phopshoproteomics",83,23572148,"MASCOT Score",29.0000000,,,,,,-0.0006000
IHHPSSPR,ph,S,20,true,"SnRK2 protein kinase substrates",85,23776212,XCorr,2.7527983,0.8890000,,,,0.00010706300236052,
IHHPSSPR,ph,S,20,true,"atm and atr DNA damage response",88,25561503,"MASCOT Score",28.0000000,0.9960000,,,,,-1.1300000
IHHPSSPR,ph,S,20,true,"TOR Kinase and ABA Receptor",100,29290610,XCorr,2.7553260,0.9534000,,,,0.0010590000310913,
HSHHHSSSTPSAATPTPTAGAR,ph,S,24,true,"srk2dei ABA signaling phopshoproteomics",83,23572148,"MASCOT Score",27.0000000,,,,,,-0.0013000
HSHHHSSSTPSAATPTPTAGAR,ph,S,28,true,"TOR Kinase and ABA Receptor",100,29290610,XCorr,5.1555405,0.8868000,,,,2.5849999474303E-7,
HSHHHSSSTPSAATPTPTAGAR,ph,S,28,true,"Tissue atlas Arabidopsis - ProteomicsDB",114,32188942,"MaxQuant score",161.5300000,0.7801700,,,,2.6301699552114E-38,
HSHHHSSSTPSAATPTPTAGAR,ph,S,30,true,"Phospho cell culture sucrose/TOR",109,30833711,,,0.8199870,,,,,
HSHHHSSSTPSAATPTPTAGAR,ph,S,30,true,"Col-0 callus - FC Col-0 vs. Col-0 Xray",111a,31410901,,62.9000000,,-3.3935792,0.0000000,NO,,0.6536413
HSHHHSSSTPSAATPTPTAGAR,ph,S,30,true,"Col-0 X-ray callus - FC Col-0 vs. Col-0 Xray",111b,31410901,,62.9000000,,-3.3935792,0.0000000,NO,,0.6536413
HSHHHSSSTPSAATPTPTAGAR,ph,S,30,true,"atm callus - FC atm vs. atm Xray",111c,31410901,,62.9000000,,6.3975746,0.0000000,NO,,0.6536413
HSHHHSSSTPSAATPTPTAGAR,ph,S,30,true,"atm-3 X-ray callus - FC atm vs. atm Xray",111d,31410901,,62.9000000,,6.3975746,0.0000000,NO,,0.6536413
HSHHHSSSTPSAATPTPTAGAR,ph,S,30,true,"Tissue atlas Arabidopsis - ProteomicsDB",114,32188942,"MaxQuant score",165.8800000,0.7869190,,,,3.9978064278262E-40,
HSHHHSSSTPSAATPTPTAGAR,ph,T,31,true,"Brassinosteroid-Regulated Phosphorylation Dynamics",94,26187819,"MaxQuant Score",118.5200000,0.9540000,,,,2.1219999979394E-8,0.3190000
HSHHHSSSTPSAATPTPTAGAR,ph,T,31,true,"Col-0 callus - FC Col-0 vs. Col-0 Xray",111a,31410901,,24.1500000,,1.0694091,0.0000000,NO,,0.3590342
HSHHHSSSTPSAATPTPTAGAR,ph,T,31,true,"Col-0 X-ray callus - FC Col-0 vs. Col-0 Xray",111b,31410901,,24.1500000,,1.0694091,0.0000000,NO,,0.3590342
HSHHHSSSTPSAATPTPTAGAR,ph,T,31,true,"atm callus - FC atm vs. atm Xray",111c,31410901,,24.1500000,,-0.9597331,0.0000000,NO,,0.3590342
HSHHHSSSTPSAATPTPTAGAR,ph,T,31,true,"atm-3 X-ray callus - FC atm vs. atm Xray",111d,31410901,,24.1500000,,-0.9597331,0.0000000,NO,,0.3590342
HSHHHSSSTPSAATPTPTAGAR,ph,T,31,true,"Tissue atlas Arabidopsis - ProteomicsDB",114,32188942,"MaxQuant score",249.3500000,0.9876610,,,,0,
IHHPSSPRHSHHHSSSTPSAATPTPTAGAR,ph,S,33,true,"Brassinosteroid-Regulated Phosphorylation Dynamics",94,26187819,"MaxQuant Score",60.2070000,0.7610000,,,,0.016000000759959,0.9960000
HSHHHSSSTPSAATPTPTAGAR,ph,S,33,true,"MAPK Arabidopsis substrates",45,23172892,"MaxQuant Score",61.3450000,,,,,,
HSHHHSSSTPSAATPTPTAGAR,ph,S,33,true,"srk2dei ABA signaling phopshoproteomics",83,23572148,"MASCOT Score",23.0000000,,,,,,-0.0007000
HSHHHSSSTPSAATPTPTAGAR,ph,S,33,true,"Col-0 callus - FC Col-0 vs. Col-0 Xray",111a,31410901,,27.9800000,,-3.7091621,0.0000000,NO,,0.5530001
HSHHHSSSTPSAATPTPTAGAR,ph,S,33,true,"Col-0 X-ray callus - FC Col-0 vs. Col-0 Xray",111b,31410901,,27.9800000,,-3.7091621,0.0000000,NO,,0.5530001
HSHHHSSSTPSAATPTPTAGAR,ph,S,33,true,"atm callus - FC atm vs. atm Xray",111c,31410901,,27.9800000,,5.6079545,0.0000000,NO,,0.5530001
HSHHHSSSTPSAATPTPTAGAR,ph,S,33,true,"atm-3 X-ray callus - FC atm vs. atm Xray",111d,31410901,,27.9800000,,5.6079545,0.0000000,NO,,0.5530001
HSHHHSSSTPSAATPTPTAGAR,ph,S,33,true,"Tissue atlas Arabidopsis - ProteomicsDB",114,32188942,"MaxQuant score",176.2700000,0.8617570,,,,1.4012984643248E-45,
HSHHHSSSTPSAATPTPTAGAR,ph,T,36,true,"MAPK Arabidopsis substrates",45,23172892,"MaxQuant Score",120.3200000,,,,,,
HSHHHSSSTPSAATPTPTAGAR,ph,T,36,true,"srk2dei ABA signaling phopshoproteomics",83,23572148,"MASCOT Score",32.0000000,,,,,,-0.0007000
HSHHHSSSTPSAATPTPTAGAR,ph,T,36,true,"Brassinosteroid-Regulated Phosphorylation Dynamics",94,26187819,"MaxQuant Score",118.5200000,0.9350000,,,,2.1219999979394E-8,-2.9900000
HSHHHSSSTPSAATPTPTAGAR,ph,T,36,true,"TOR Kinase and ABA Receptor",100,29290610,XCorr,5.1555405,1.0000000,,,,2.5849999474303E-7,
HSHHHSSSTPSAATPTPTAGAR,ph,T,36,true,"Phospho cell culture sucrose/TOR",109,30833711,,,0.9997840,,,,,
HSHHHSSSTPSAATPTPTAGAR,ph,T,36,true,"Col-0 callus - FC Col-0 vs. Col-0 Xray",111a,31410901,,44.8100000,,-0.0640441,0.0000000,NO,,0.0058974
HSHHHSSSTPSAATPTPTAGAR,ph,T,36,true,"Col-0 X-ray callus - FC Col-0 vs. Col-0 Xray",111b,31410901,,44.8100000,,-0.0640441,0.0000000,NO,,0.0058974
HSHHHSSSTPSAATPTPTAGAR,ph,T,36,true,"atm callus - FC atm vs. atm Xray",111c,31410901,,44.8100000,,4.4213708,0.0000000,NO,,0.0058974
HSHHHSSSTPSAATPTPTAGAR,ph,T,36,true,"atm-3 X-ray callus - FC atm vs. atm Xray",111d,31410901,,44.8100000,,4.4213708,0.0000000,NO,,0.0058974
HSHHHSSSTPSAATPTPTAGAR,ph,T,36,true,"Tissue atlas Arabidopsis - ProteomicsDB",114,32188942,"MaxQuant score",249.3500000,0.9999930,,,,0,
HSHHHSSSTPSAATPTPTAGARR,ph,T,38,true,"MAPK Arabidopsis substrates",45,23172892,"MaxQuant Score",73.9280000,,,,,,
HSHHHSSSTPSAATPTPTAGAR,ph,T,38,true,"MAPK Arabidopsis substrates",45,23172892,"MaxQuant Score",129.4300000,,,,,,
HSHHHSSSTPSAATPTPTAGAR,ph,T,38,true,"Phosphoproteome ethylene-regulated time response",46,24043427,"MASCOT Score",41.1000000,,,,,,6.1369000
HSHHHSSSTPSAATPTPTAGAR,ph,T,38,true,"srk2dei ABA signaling phopshoproteomics",83,23572148,"MASCOT Score",32.0000000,,,,,,-0.0007000
HSHHHSSSTPSAATPTPTAGAR,ph,T,38,true,"atm and atr DNA damage response",88,25561503,"MASCOT Score",62.0000000,1.0000000,,,,,-1.0800000
HSHHHSSSTPSAATPTPTAGAR,ph,T,38,true,"Brassinosteroid-Regulated Phosphorylation Dynamics",94,26187819,"MaxQuant Score",118.5200000,0.9740000,,,,2.1219999979394E-8,-2.9900000
HSHHHSSSTPSAATPTPTAGAR,ph,T,38,true,"TOR Kinase and ABA Receptor",100,29290610,XCorr,5.1555405,0.9870000,,,,2.5849999474303E-7,
HSHHHSSSTPSAATPTPTAGAR,ph,T,38,true,"Phospho cell culture sucrose/TOR",109,30833711,,,0.9977630,,,,,
HSHHHSSSTPSAATPTPTAGAR,ph,T,38,true,"Col-0 callus - FC Col-0 vs. Col-0 Xray",111a,31410901,,54.8200000,,-0.6845828,0.0000000,NO,,0.1737101
HSHHHSSSTPSAATPTPTAGAR,ph,T,38,true,"Col-0 X-ray callus - FC Col-0 vs. Col-0 Xray",111b,31410901,,54.8200000,,-0.6845828,0.0000000,NO,,0.1737101
HSHHHSSSTPSAATPTPTAGAR,ph,T,38,true,"atm callus - FC atm vs. atm Xray",111c,31410901,,54.8200000,,2.6294525,0.0000000,NO,,0.1737101
HSHHHSSSTPSAATPTPTAGAR,ph,T,38,true,"atm-3 X-ray callus - FC atm vs. atm Xray",111d,31410901,,54.8200000,,2.6294525,0.0000000,NO,,0.1737101
HSHHHSSSTPSAATPTPTAGAR,ph,T,38,true,"Tissue atlas Arabidopsis - ProteomicsDB",114,32188942,"MaxQuant score",237.5000000,0.9992400,,,,0,
HSHHHSSSTPSAATPTPTAGAR,ph,T,40,true,"srk2dei ABA signaling phopshoproteomics",83,23572148,"MASCOT Score",27.0000000,,,,,,-0.0013000
LCLETER,sno,C,156,true,"hot5-4 / wildtype, FAT-switch S-nitrosoproteome",169,37277371,,,,-0.2952228,0.1008345,NO,,
ERLCLETER,so,C,156,true,"Arabidopsis S-sulfenylation chemoproteomics",108,31578252,"pFind PSM Score",0.0385147,,1.2048200,,,,-1.6416659
LCLETER,so,C,156,true,"S-sulfenylation site detection using YAP1C",110,32714340,,,,,,,,
LGSVSDYCVHHCVCPVVVVR,so,C,196,false,"S-sulfenylation site detection using YAP1C",110,32714340,,,,,,,,
EAIVTVKSR,nt,E,223,true,"Metacaspase9 substrates - Col-0 / mc9",51a,23964026,"MASCOT Score",52.0000000,,2.2676616,,NO,,-0.5218761
EAIVTVKSR,ac,K,229,true,"Quantitative Acetylproteomics",101,29440448,,,,,,,,
EAIVTVKSR,ub,K,229,true,"Arabidopsis ubiquitination COFRADIC",40,26744219,"MaxQuant Score",108.4300000,1.0000000,,,,0.003000000026077,0.0970000
EAIVTVKSR,ph,S,230,true,"atm and atr DNA damage response",88,25561503,"MASCOT Score",30.0000000,0.9990000,,,,,-2.2400000
EAIVTVKSR,ph,S,230,true,"Tissue atlas Arabidopsis - ProteomicsDB",114,32188942,"MaxQuant score",140.6300000,0.9972400,,,,0.0001579119998496,
IAAAASDHHEHIKDE,ph,S,251,true,"TOR Kinase and ABA Receptor",100,29290610,XCorr,2.9033711,1.0000000,,,,0.00014259999443311,
IAAAASDHHEHIKDE,ph,S,251,true,"Tissue atlas Arabidopsis - ProteomicsDB",114,32188942,"MaxQuant score",91.6220000,1.0000000,,,,2.1155499780434E-5,
IAAAASDHHEHIK,ph,S,251,true,"TOR Kinase and ABA Receptor",100,29290610,XCorr,2.2923293,1.0000000,,,,0.0021500000730157,
