Peptide,PTM,ModifiedAA,ModifiedPosition,PeptideUniqueToGene,ExperimentDesc,ExpID,PubmedID,ScoreType,IdentScore,LocProb,Log2FChange,PQ-val,QuantSig,PEP,MassErrorPPM
GKQLGSGAAKKSTSR,ac,K,6,true,"Histone deacetylases - apicidin vs control",98a,29061669,"MaxQuant Score",124.4000000,1.0000000,1.4730000,0.1520548,NO,2.0999999961191E-8,
GKQLGSGAAKK,ac,K,6,true,"Histone deacetylases- hda14 vs WT (low light)",98c,29061669,"MaxQuant Score",176.4200000,1.0000000,-0.3260000,0.9885531,NO,3.8999998650979E-5,
GKQLGSGAAKK,ac,K,6,true,"Quantitative Acetylproteomics",101,29440448,,,,,,,,
GKQLGSGAAK,ac,K,6,true,"Histone deacetylases - hda14 vs WT (thylakoids)",98d,29061669,"MaxQuant Score",82.4000000,1.0000000,0.4070000,0.8892011,NO,0.0070000002160668,
GKQLGSGAAKKSTSR,ac,K,14,true,"Histone deacetylases - apicidin vs control",98a,29061669,"MaxQuant Score",124.4000000,1.0000000,1.4730000,0.1520548,NO,2.0999999961191E-8,
GKQLGSGAAKK,ac,K,14,true,"Histone deacetylases- hda14 vs WT (low light)",98c,29061669,"MaxQuant Score",176.4200000,1.0000000,-0.3260000,0.9885531,NO,3.8999998650979E-5,
GKQLGSGAAKK,ac,K,14,true,"Quantitative Acetylproteomics",101,29440448,,,,,,,,
GKQLGSGAAKKSTSR,ac,K,15,true,"Histone deacetylases - apicidin vs control",98a,29061669,"MaxQuant Score",124.4000000,1.0000000,1.4730000,0.1520548,NO,2.0999999961191E-8,
GKQLGSGAAKKSTSR,ub,K,15,true,"Arabidopsis ubiquitination COFRADIC",40,26744219,"MaxQuant Score",42.9470000,0.7910000,,,,0.0080000003799796,-0.3170000
SSKAGLQFPVGR,ub,K,22,false,"Arabidopsis ubiquitination COFRADIC",40,26744219,"MaxQuant Score",150.5100000,1.0000000,,,,1.7890000563181E-20,0.3340000
SSKAGLQFPVGR,ub,K,22,false,"upl3 mutant / wildtype",168,35926874,"MaxQuant score",98.1820000,1.0000000,0.1296127,0.8544800,NO,6.7022199800704E-5,0.4765700
FLKAGKYAER,ub,K,37,false,"Arabidopsis ubiquitination COFRADIC",40,26744219,"MaxQuant Score",53.2110000,0.9920000,,,,0.003000000026077,-0.3870000
FLKAGKYAER,ub,K,40,false,"Arabidopsis ubiquitination COFRADIC",40,26744219,"MaxQuant Score",74.6110000,1.0000000,,,,0.00076650001574308,0.0440000
AAEVLELAGNAAR,nt,A,61,false,"Metacaspase9 substrates - Col-0 / mc9",51a,23964026,"MASCOT Score",70.0000000,,1.0806794,,NO,,-1.1784287
LLGDVTIANGGVMPNIHNLLLPKK,ub,K,120,false,"upl3 mutant / wildtype",168,35926874,"MaxQuant score",71.1480000,1.0000000,0.7415748,0.2433000,NO,1.2171500429758E-7,-0.8636800
