Peptide,PTM,ModifiedAA,ModifiedPosition,PeptideUniqueToGene,ExperimentDesc,ExpID,PubmedID,ScoreType,IdentScore,LocProb,Log2FChange,PQ-val,QuantSig,PEP,MassErrorPPM
DLTSNEGSEYGGPVEFTR,ph,S,22,true,"atm and atr DNA damage response",88,25561503,"MASCOT Score",38.0000000,0.9450000,,,,,-0.3700000
DLTSNEGSEYGGPVEFTR,ph,S,22,true,"Tissue atlas Arabidopsis - ProteomicsDB",114,32188942,"MaxQuant score",116.0900000,0.9376590,,,,4.5073100807258E-10,
DLTSNEGSEYGGPVEFTREDVETLLHER,ph,S,26,true,"TOR Kinase and ABA Receptor",100,29290610,XCorr,3.6806808,0.9620000,,,,0.00011850000009872,
DLTSNEGSEYGGPVEFTR,ph,S,26,true,"Large-scale phosphorylation discovery",44,23111157,XCorr,5.5670000,,,,,,
DLTSNEGSEYGGPVEFTR,ph,S,26,true,"srk2dei ABA signaling phopshoproteomics",83,23572148,"MASCOT Score",32.0000000,,,,,,-0.0016000
DLTSNEGSEYGGPVEFTR,ph,S,26,true,"atm and atr DNA damage response",88,25561503,"MASCOT Score",44.0000000,1.0000000,,,,,-0.0700000
DLTSNEGSEYGGPVEFTR,ph,S,26,true,"Tissue atlas Arabidopsis - ProteomicsDB",114,32188942,"MaxQuant score",301.3400000,1.0000000,,,,0,
DLTSNEGSEYGGPVEFTR,ph,Y,28,true,"Large-scale phosphorylation discovery",44,23111157,XCorr,5.8450000,,,,,,
KQNDFKDTINE,nt,K,296,true,"HUNTER N-terminome: legumain, GluC and trypsin",119,31951383,"MaxQuant score",129.3800000,,,,,,
KQNDFKDTIN,nt,K,296,true,"HUNTER N-terminome: legumain, GluC and trypsin",119,31951383,"MaxQuant score",95.0990000,,,,,,
SVGKTAMNEQSSR,nt,S,590,true,"Arabidopsis translation initiation landscape - NT",167b,35069635,,,,,,,,
HVNARPLDYRLSLG,ph,S,743,true,"Tissue atlas Arabidopsis - ProteomicsDB",114,32188942,"MaxQuant score",106.4400000,1.0000000,,,,3.1475599826081E-5,
PLDYRLSLG,ph,S,743,true,"atm and atr DNA damage response",88,25561503,"MASCOT Score",31.0000000,1.0000000,,,,,-1.9000000
