Peptide,PTM,ModifiedAA,ModifiedPosition,PeptideUniqueToGene,ExperimentDesc,ExpID,PubmedID,ScoreType,IdentScore,LocProb,Log2FChange,PQ-val,QuantSig,PEP,MassErrorPPM
CQKEFQQSQHLR,pgk,K,47,false,"Open search Plant PTM Viewer 2.0 - 3pgK",164f,TBA,,,,,,,,
EFQQSQHLR,ph,S,52,false,"Tissue atlas Arabidopsis - ProteomicsDB",114,32188942,"MaxQuant score",97.2840000,1.0000000,,,,0.00045049499021843,
PQGPQQGHQILQQCCSELR,nt,P,89,true,"N-terminal ChaFRADIC",92,26010716,"MASCOT Score",20.0200000,,,,,1.4310000295836E-8,
PQGPQQGHQILQQCCSE,nt,P,89,true,"N-terminal ChaFRADIC",92,26010716,"MASCOT Score",20.1100000,,,,,1.1570000424399E-5,
PQGPQQGHQILQQCCSE,nt,P,89,true,"Arg/N-end rule seed, prt6 vs. Wt",99,29168982,"MASCOT Score",47.1100000,,0.4940739,0.4535874,NO,1.7090000525855E-8,-1.3384190
GPQQGHQILQQCCSELR,nt,G,91,true,"N-terminal ChaFRADIC",92,26010716,"MASCOT Score",44.6200000,,,,,2.578999902525E-9,
GPQQGHQILQQCCSE,nt,G,91,true,"Arg/N-end rule seed, prt6 vs. Wt",99,29168982,"MASCOT Score",40.6200000,,0.4782890,0.1367631,NO,1.95799998437E-6,-3.2186422
GHQILQQCCSE,nt,G,95,true,"Arg/N-end rule seed, prt6 vs. Wt",99,29168982,"MASCOT Score",39.9500000,,0.4056856,0.4825331,NO,3.1119998311624E-5,-4.1219610
QEEPVCVCPTLR,nt,Q,108,false,"Metacaspase9 substrates - 35S:MC9 / mc9",51b,23964026,"MASCOT Score",62.0000000,,1.0287721,,NO,,-1.1532932
QEEPVCVCPT,nt,Q,108,false,"Arg/N-end rule seed, prt6 vs. Wt",99,29168982,"MASCOT Score",39.4900000,,,,,0.074709996581078,-3.8583476
QEEPVCVCPTLR,sno,C,115,false,"hot5-4 / wildtype, FAT-switch S-nitrosoproteome",169,37277371,,,,,,,,
AVSLQGQHGPFQSR,ph,S,126,false,"Tissue atlas Arabidopsis - ProteomicsDB",114,32188942,"MaxQuant score",204.5200000,1.0000000,,,,4.6733303785233E-42,
YLPNICK,sno,C,150,false,"hot5-4 / wildtype, FAT-switch S-nitrosoproteome",169,37277371,,,,,,,,
