Peptide,PTM,ModifiedAA,ModifiedPosition,PeptideUniqueToGene,ExperimentDesc,ExpID,PubmedID,ScoreType,IdentScore,LocProb,Log2FChange,PQ-val,QuantSig,PEP,MassErrorPPM
GFKRYVEIGRVALVNYGE,nt,G,2,true,"Arabidopsis translation initiation landscape - NT",167b,35069635,,,,,,,,
DVVDQNR,nt,D,29,false,"Arg/N-end rule seed, prt6 vs. Wt",99,29168982,"MASCOT Score",43.3300000,,-1.1362376,0.0013321,YES,0.17069999873638,-0.5670837
IQMNFKR,ac,K,51,true,"Quantitative Acetylproteomics",101,29440448,,,,,,,,
SLTDIVIDINR,nt,S,54,false,"Arg/N-end rule seed, prt6 vs. Wt",99,29168982,"MASCOT Score",60.4300000,,-1.1672004,0.0421669,YES,0.022530000656843,-1.0672480
ADVKNKWEK,ac,K,81,false,"Quantitative Acetylproteomics",101,29440448,,,,,,,,
KLIVQKR,ac,K,97,false,"Quantitative Acetylproteomics",101,29440448,,,,,,,,
KLIVQKR,ub,K,97,false,"Arabidopsis ubiquitination COFRADIC",40,26744219,"MaxQuant Score",79.1160000,1.0000000,,,,0.010999999940395,1.1900000
RANLNDFDR,me1,R,99,true,"Arabidopsis protein methylome",123,31809900,"MaxQuant Score",150.1000000,1.0000000,,,,0,0.1785100
RANLNDFDR,me2,R,99,true,"Arabidopsis protein methylome",123,31809900,"MaxQuant Score",92.6110000,1.0000000,,,,6.5430100448793E-8,0.1578900
QELAKLKKEITA,ub,K,130,true,"Arabidopsis ubiquitination COFRADIC",40,26744219,"MaxQuant Score",64.2240000,0.9900000,,,,0.012000000104308,-0.4940000
