Peptide,PTM,ModifiedAA,ModifiedPosition,PeptideUniqueToGene,ExperimentDesc,ExpID,PubmedID,ScoreType,IdentScore,LocProb,Log2FChange,PQ-val,QuantSig,PEP,MassErrorPPM
STPTTSGSAAKPTR,nt,S,2,true,"Arg/N-end rule seed, prt6 vs. Wt",99,29168982,"MASCOT Score",47.5500000,,,,,0.039919998496771,-1.9145698
STPTTSGSAAKPTR,nta,S,2,true,"Arg/N-end rule seed, prt6 vs. Wt",99,29168982,"MASCOT Score",47.5500000,,-0.2686415,0.3586073,NO,0.039919998496771,-1.9145698
STPTTSGSAAKPTRPAR,ph,S,7,true,"Tissue atlas Arabidopsis - ProteomicsDB",114,32188942,"MaxQuant score",46.3180000,0.7685870,,,,0.0036679399199784,
STPTTSGSAAKPTRPAR,ph,S,9,true,"Tissue atlas Arabidopsis - ProteomicsDB",114,32188942,"MaxQuant score",46.3530000,0.7781310,,,,0.001857309951447,
SSSLATR,ph,S,21,true,"Protein sumoylation and phosphorylation cross-talk",97,28419593,,,,,,,,
TDSTITVLETCR,sno,C,301,true,"hot5-4 / wildtype, FAT-switch S-nitrosoproteome",169,37277371,,,,0.3537173,0.0158670,NO,,
YVDGASDDSK,ph,S,332,true,"atm and atr DNA damage response",88,25561503,"MASCOT Score",52.0000000,1.0000000,,,,,-1.3200000
LSASEQLGSEK,ph,S,345,true,"atm and atr DNA damage response",88,25561503,"MASCOT Score",59.0000000,1.0000000,,,,,-0.2800000
LSASEQLGSEK,ph,S,345,true,"Tissue atlas Arabidopsis - ProteomicsDB",114,32188942,"MaxQuant score",190.8100000,1.0000000,,,,3.0695500003325E-18,
KEASDGSTLSPDSASK,ph,S,370,true,"Large-scale phosphorylation discovery",44,23111157,XCorr,4.0550000,,,,,,
KEASDGSTLSPDSASK,ph,S,370,true,"atm and atr DNA damage response",88,25561503,"MASCOT Score",85.0000000,1.0000000,,,,,-3.4400000
EASDGSTLSPDSASK,ph,S,370,true,"atm and atr DNA damage response",88,25561503,"MASCOT Score",30.0000000,1.0000000,,,,,-0.0400000
EASDGSTLSPDSASK,ph,S,370,true,"Protein sumoylation and phosphorylation cross-talk",97,28419593,,,,,,,,
EASDGSTLSPDSASK,ph,S,370,true,"TOR Kinase and ABA Receptor",100,29290610,XCorr,5.2840586,0.9973000,,,,3.3869998361524E-8,
EASDGSTLSPDSASK,ph,S,370,true,"Lateral root-induction - NAA vs control",106,23328941,"MASCOT Score",51.0000000,,-0.4421899,0.0331781,YES,,
EASDGSTLSPDSASK,ph,S,370,true,"Tissue atlas Arabidopsis - ProteomicsDB",114,32188942,"MaxQuant score",335.2200000,0.9999220,,,,0,
KEASDGSTLSPDSASK,ph,S,373,true,"Tissue atlas Arabidopsis - ProteomicsDB",114,32188942,"MaxQuant score",212.0000000,0.9969840,,,,0,
EASDGSTLSPDSASK,ph,S,373,true,"atm and atr DNA damage response",88,25561503,"MASCOT Score",30.0000000,0.9960000,,,,,-0.0400000
RQSVEVVVPR,ph,S,414,true,"Arabidopsis root NAA phosphoproteome",18a,27643528,"MaxQuant Score",48.5680000,1.0000000,,,,0.00086829997599125,0.1260000
RQSVEVVVPR,ph,S,414,true,"Phosphorylation nuclei-enriched fractions",28,19245862,,,,,,,,
RQSVEVVVPR,ph,S,414,true,"STN8 phosphoproteome",38,21768351,"MASCOT Score",65.4700000,,,,,,-0.3604060
RQSVEVVVPR,ph,S,414,true,"Phosphoproteome ethylene-regulated time response",46,24043427,"MASCOT Score",69.5300000,,,,,,-5.4301000
RQSVEVVVPR,ph,S,414,true,"Conserved plant phosphoproteome - Arabidopsis",61a,20466843,"MASCOT Score",23.0000000,1.0000000,,,,,
RQSVEVVVPR,ph,S,414,true,"srk2dei ABA signaling phopshoproteomics",83,23572148,"MASCOT Score",70.0000000,,,,,,0.0000000
RQSVEVVVPR,ph,S,414,true,"LAXIC - ABA stress",84a,23660473,XCorr,2.2800000,1.0000000,,,,0.10845299810171,
RQSVEVVVPR,ph,S,414,true,"LAXIC - mannitol vs control",84b,23660473,XCorr,2.7300000,1.0000000,2.0074166,,NO,2.2399999579648E-6,
RQSVEVVVPR,ph,S,414,true,"SnRK2 protein kinase substrates",85,23776212,XCorr,2.4554133,1.0000000,,,,0.0009155219886452,
RQSVEVVVPR,ph,S,414,true,"atm and atr DNA damage response",88,25561503,"MASCOT Score",53.0000000,1.0000000,,,,,0.5300000
RQSVEVVVPR,ph,S,414,true,"TOR Kinase and ABA Receptor",100,29290610,XCorr,3.7792201,1.0000000,,,,1.5949999578879E-5,
RQSVEVVVPR,ph,S,414,true,"Phospho cell culture sucrose/TOR",109,30833711,,,1.0000000,,,,,
RQSVEVVVPR,ph,S,414,true,"Tissue atlas Arabidopsis - ProteomicsDB",114,32188942,"MaxQuant score",162.9300000,1.0000000,,,,3.4679999316722E-7,
RQSVEVVVPR,ph,S,414,true,"Touch-induced phosphorylation: 40s touch vs untouc",136,30291188,"MASCOT score",64.8200000,,0.1732173,0.2162123,NO,,5.8224505
ETPGHHAPVSNTDNQSEGSFTSNR,ph,T,482,true,"Tissue atlas Arabidopsis - ProteomicsDB",114,32188942,"MaxQuant score",119.4300000,0.9998550,,,,9.8090892502737E-45,
ETPGHHAPVSNTDNQSEGSFTSNR,ph,S,496,true,"TOR Kinase and ABA Receptor",100,29290610,XCorr,3.5855455,0.9887000,,,,0.00026420000358485,
ETPGHHAPVSNTDNQSEGSFTSNR,ph,S,496,true,"Tissue atlas Arabidopsis - ProteomicsDB",114,32188942,"MaxQuant score",219.1900000,0.9999590,,,,0,
ETPGHHAPVSNTDNQSEGSFTSNR,ph,S,499,true,"Tissue atlas Arabidopsis - ProteomicsDB",114,32188942,"MaxQuant score",62.0490000,0.8618460,,,,8.1510297604837E-6,
YNSFANYPTGK,ph,S,579,true,"STN8 phosphoproteome",38,21768351,"MASCOT Score",42.2000000,,,,,,-0.0054988
YNSFANYPTGK,ph,S,579,true,"LAXIC - ABA stress",84a,23660473,XCorr,2.5000000,0.9930000,,,,0.00081841001519933,
YNSFANYPTGK,ph,S,579,true,"atm and atr DNA damage response",88,25561503,"MASCOT Score",59.0000000,1.0000000,,,,,-0.2800000
YNSFANYPTGK,ph,S,579,true,"TOR Kinase and ABA Receptor",100,29290610,XCorr,3.3244560,0.9924000,,,,8.8729997514747E-5,
YNSFANYPTGK,ph,S,579,true,"Phospho cell culture sucrose/TOR",109,30833711,,,1.0000000,,,,,
YNSFANYPTGK,ph,S,579,true,"Tissue atlas Arabidopsis - ProteomicsDB",114,32188942,"MaxQuant score",269.1500000,1.0000000,,,,0,
APGERGSQTDGAMR,ph,S,598,true,"Tissue atlas Arabidopsis - ProteomicsDB",114,32188942,"MaxQuant score",42.3380000,0.8468890,,,,0.0098514202982187,
SEQYENEHMGNGR,ph,S,638,true,"Tissue atlas Arabidopsis - ProteomicsDB",114,32188942,"MaxQuant score",100.5800000,1.0000000,,,,0.00021440999989863,
FGEGPSAR,ph,S,668,true,"atm and atr DNA damage response",88,25561503,"MASCOT Score",35.0000000,1.0000000,,,,,-0.5200000
FGEGPSAR,ph,S,668,true,"Tissue atlas Arabidopsis - ProteomicsDB",114,32188942,"MaxQuant score",128.8100000,1.0000000,,,,0.002950320020318,
