Peptide,PTM,ModifiedAA,ModifiedPosition,PeptideUniqueToGene,ExperimentDesc,ExpID,PubmedID,ScoreType,IdentScore,LocProb,Log2FChange,PQ-val,QuantSig,PEP,MassErrorPPM
ASSTSDSVVTLLDYGAGNVR,nt,A,56,true,"N-terminal ChaFRADIC",92,26010716,"MASCOT Score",79.9400000,,,,,1.3310000213096E-5,
ASSTSDSVVTLLDYGAGNVR,nt,A,56,true,"Arabidopsis translation initiation landscape - NT",167b,35069635,,,,,,,,
ASSTSDSVVTLLDYGAGNVR,nta,A,56,true,"N-terminal ChaFRADIC",92,26010716,"MASCOT Score",79.9400000,,,,,1.3310000213096E-5,
ASSTSDSVVTLLDYGAGNVR,nta,A,56,true,"FtsH12 N-terminome: WT / FtsH12 knockdown miRNA",118,33216923,"MaxQuant score",40.5020000,,,,,0.0050375000573695,
SSTSDSVVTLLDYGAGNVR,nt,S,57,true,"Arg/N-end rule pathway Roots",80,25728785,"MASCOT Score",139.6200000,,,,,1.8164899486554E-16,
SSTSDSVVTLLDYGAGNVR,nt,S,57,true,"Tic56 chloroplast import - wild-type",89a,25588737,XCorr,5.1322107,,,,,,
SSTSDSVVTLLDYGAGNVR,nt,S,57,true,"Tic56 chloroplast import - ppi2",89b,25588737,XCorr,5.6559033,,,,,,
SSTSDSVVTLLDYGAGNVR,nt,S,57,true,"Tic56 chloroplast import - tic56-1",89c,25588737,XCorr,4.9549398,,,,,,
SSTSDSVVTLLDYGAGNVR,nt,S,57,true,"N-terminal ChaFRADIC",92,26010716,"MASCOT Score",82.6200000,,,,,2.2369999186367E-8,
SSTSDSVVTLLDYGAGNVR,nt,S,57,true,"Stromal N-terminome",96,26371235,"MASCOT Score",133.6300000,,,,,,
SSTSDSVVTLLDYGAGNVR,nt,S,57,true,"Arg/N-end rule seed, prt6 vs. Wt",99,29168982,"MASCOT Score",67.8800000,,0.0552339,0.7014486,NO,6.8790002842434E-5,-3.6524391
SSTSDSVVTLLDYGAGNVR,nt,S,57,true,"HUNTER N-terminome: legumain, GluC and trypsin",119,31951383,"MaxQuant score",176.2800000,,,,,,
SSTSDSVVTLLDYGAGNVR,nt,S,57,true,"Arabidopsis translation initiation landscape - NT",167b,35069635,,,,,,,,
SSTSDSVVTLLDYGAGN,nt,S,57,true,"HUNTER N-terminome: legumain, GluC and trypsin",119,31951383,"MaxQuant score",147.3300000,,,,,,
SSTSDSVVTLLDYGAGNVR,nta,S,57,true,"N-terminal ChaFRADIC",92,26010716,"MASCOT Score",82.6200000,,,,,2.2369999186367E-8,
SSTSDSVVTLLDYGAGNVR,nta,S,57,true,"FtsH12 N-terminome: WT / FtsH12 knockdown miRNA",118,33216923,"MaxQuant score",111.6500000,,,,,6.7499996703191E-8,
SSTSDSVVTLLDYGAGNVR,nta,S,57,true,"HUNTER N-terminome: legumain, GluC and trypsin",119,31951383,"MaxQuant score",167.4400000,,,,,,
DVQTPGDILNADR,ph,T,93,true,"Tissue atlas Arabidopsis - ProteomicsDB",114,32188942,"MaxQuant score",165.5800000,1.0000000,,,,7.0218303394043E-11,
TGMAEALCK,so,C,128,true,"Arabidopsis S-sulfenylation chemoproteomics",108,31578252,"pFind PSM Score",0.0994680,,0.9962300,,,,0.8800930
FDASAGIR,ph,S,173,true,"Tissue atlas Arabidopsis - ProteomicsDB",114,32188942,"MaxQuant score",96.0340000,1.0000000,,,,0.0057838200591505,
DWISSTCNYGESFISSIR,so,C,225,true,"S-sulfenylation site detection using YAP1C",110,32714340,,,,,,,,
VIACLDVR,so,C,287,true,"Arabidopsis S-sulfenylation chemoproteomics",108,31578252,"pFind PSM Score",0.1158540,,,,,,-1.5099957
VIACLDVR,so,C,287,true,"S-sulfenylation site detection using YAP1C",110,32714340,,,,,,,,
QTSKNVFVPLTVGGGIR,ac,K,365,true,"Quantitative Acetylproteomics",101,29440448,,,,,,,,
TGKSSLEQISR,ac,K,427,true,"Quantitative Acetylproteomics",101,29440448,,,,,,,,
VTNPGPNGEEYAWYQCTVSGGR,ox,C,481,true,"SPEAR - 10 mM H2O2 / mock",138a,34619326,,,,3.2313388,0.0021825,YES,,
VTNPGPNGEEYAWYQCTVSGGR,ox,C,481,true,"SPEAR - 50 mM H2O2 / mock",138b,34619326,,,,2.5752630,0.0343964,YES,,
VTNPGPNGEEYAWYQCTVSGGR,so,C,481,true,"Arabidopsis S-sulfenylation chemoproteomics",108,31578252,"pFind PSM Score",0.3267720,,,,,,-2.2185508
