Peptide,PTM,ModifiedAA,ModifiedPosition,PeptideUniqueToGene,ExperimentDesc,ExpID,PubmedID,ScoreType,IdentScore,LocProb,Log2FChange,PQ-val,QuantSig,PEP,MassErrorPPM
GEDTKATIEPTANKTTSLEKPSE,nt,G,2,true,"Arabidopsis translation initiation landscape - NT",167b,35069635,,,,,,,,
GEDTKATIEPTANKTTSLE,nt,G,2,true,"HUNTER N-terminome: legumain, GluC and trypsin",119,31951383,"MaxQuant score",91.8890000,,,,,,
GEDTKATIEPTAN,nt,G,2,true,"Arg/N-end rule seed, prt6 vs. Wt",99,29168982,"MASCOT Score",37.6400000,,-0.1756353,0.1736789,NO,0.017100000753999,-1.5884158
GEDTKATIEPTAN,nta,G,2,true,"Arg/N-end rule seed, prt6 vs. Wt",99,29168982,"MASCOT Score",36.7900000,,0.0710016,0.5760687,NO,0.031270001083612,-1.5314341
ATIEPTANKTTSLEKPSEAMAGK,ac,K,15,true,"Quantitative Acetylproteomics",101,29440448,,,,,,,,
TTSLEKPSEAMAGK,ph,T,17,true,"atm and atr DNA damage response",88,25561503,"MASCOT Score",44.0000000,0.9840000,,,,,-1.2500000
TTSLEKPSEAMAGK,ph,S,18,true,"SnRK2 protein kinase substrates",85,23776212,XCorr,2.2394733,0.7610000,,,,0.0046031600795686,
TTSLEKPSEAMAGK,ph,S,18,true,"atm and atr DNA damage response",88,25561503,"MASCOT Score",36.0000000,1.0000000,,,,,-0.7500000
TTSLEKPSEAMAGK,ph,S,18,true,"Phospho cell culture sucrose/TOR",109,30833711,,,0.9993930,,,,,
TTSLEKPSEAMAGK,ph,S,18,true,"Tissue atlas Arabidopsis - ProteomicsDB",114,32188942,"MaxQuant score",248.9400000,0.9999900,,,,0,
KEQTDDGVSVEDTVMK,ph,T,115,true,"Tissue atlas Arabidopsis - ProteomicsDB",114,32188942,"MaxQuant score",188.3400000,1.0000000,,,,6.3460501003207E-27,
EQTDDGVSVEDTVMK,ph,S,120,true,"atm and atr DNA damage response",88,25561503,"MASCOT Score",28.0000000,1.0000000,,,,,0.8100000
EQTDDGVSVEDTVMK,ph,S,120,true,"TOR Kinase and ABA Receptor",100,29290610,XCorr,4.1135759,0.9998000,,,,1.8629999658515E-6,
EQTDDGVSVEDTVMK,ph,S,120,true,"Tissue atlas Arabidopsis - ProteomicsDB",114,32188942,"MaxQuant score",213.0200000,0.9999940,,,,0,
DGNTGDIKEEGTLVDEDKGTDMDEK,ph,T,194,true,"STN8 phosphoproteome",38,21768351,"MASCOT Score",51.9000000,,,,,,
DGNTGDIKEEGTLVDEDKGTDMDEK,ph,T,194,true,"Chloroplast kinase substrates",60,19376835,"MASCOT Score",47.7400000,,,,,,-1.0372900
DGNTGDIKEEGTLVDEDKGTDMDEK,ph,T,194,true,"srk2dei ABA signaling phopshoproteomics",83,23572148,"MASCOT Score",53.0000000,,,,,,0.0022000
DGNTGDIKEEGTLVDEDKGTDMDEK,ph,T,194,true,"SnRK2 protein kinase substrates",85,23776212,XCorr,3.7126064,1.0000000,,,,0.0026994200889021,
DGNTGDIKEEGTLVDEDKGTDMDEK,ph,T,194,true,"Phospho cell culture sucrose/TOR",109,30833711,,,1.0000000,,,,,
EEGTLVDEDKGTDMDEK,ph,T,194,true,"srk2dei ABA signaling phopshoproteomics",83,23572148,"MASCOT Score",53.0000000,,,,,,0.0011000
EEGTLVDEDKGTDMDEK,ph,T,194,true,"TOR Kinase and ABA Receptor",100,29290610,XCorr,3.1647580,1.0000000,,,,0.014560000039637,
EEGTLVDEDKGTDMDEK,ph,T,194,true,"Tissue atlas Arabidopsis - ProteomicsDB",114,32188942,"MaxQuant score",313.4300000,1.0000000,,,,0,
AEVDESKVEDEK,ph,S,238,true,"TOR Kinase and ABA Receptor",100,29290610,XCorr,4.3785858,1.0000000,,,,2.7879999834113E-5,
AEVDESKVEDEK,ph,S,238,true,"Tissue atlas Arabidopsis - ProteomicsDB",114,32188942,"MaxQuant score",170.3500000,1.0000000,,,,1.8414199811777E-14,
AEVDESKVEDEKEGSEDENDNEKVESK,ph,S,247,true,"atm and atr DNA damage response",88,25561503,"MASCOT Score",27.0000000,1.0000000,,,,,-0.5500000
AEVDESKVEDEKEGSEDENDNEK,ph,S,247,true,"Arabidopsis root NAA phosphoproteome",18a,27643528,"MaxQuant Score",153.1200000,1.0000000,,,,1.8970000411819E-34,-0.4660000
AEVDESKVEDEKEGSEDENDNEK,ph,S,247,true,"STN8 phosphoproteome",38,21768351,"MASCOT Score",83.1300000,,,,,,-1.4463400
AEVDESKVEDEKEGSEDENDNEK,ph,S,247,true,"Chloroplast kinase substrates",60,19376835,"MASCOT Score",73.6600000,,,,,,-0.8366030
AEVDESKVEDEKEGSEDENDNEK,ph,S,247,true,"srk2dei ABA signaling phopshoproteomics",83,23572148,"MASCOT Score",82.0000000,,,,,,0.0000000
AEVDESKVEDEKEGSEDENDNEK,ph,S,247,true,"LAXIC - ABA stress",84a,23660473,XCorr,4.9300000,1.0000000,,,,0.0032332700211555,
AEVDESKVEDEKEGSEDENDNEK,ph,S,247,true,"LAXIC - mannitol vs control",84b,23660473,XCorr,5.0700000,1.0000000,-1.7159928,,NO,4.7400000591225E-12,
AEVDESKVEDEKEGSEDENDNEK,ph,S,247,true,"SnRK2 protein kinase substrates",85,23776212,XCorr,5.9709611,1.0000000,,,,0.00012104799679946,
AEVDESKVEDEKEGSEDENDNEK,ph,S,247,true,"Brassinosteroid-Regulated Phosphorylation Dynamics",94,26187819,"MaxQuant Score",69.7790000,1.0000000,,,,0.018999999389052,1.0200000
AEVDESKVEDEKEGSEDENDNEK,ph,S,247,true,"TOR Kinase and ABA Receptor",100,29290610,XCorr,4.1484098,0.9995000,,,,9.7680000180844E-5,
VEDEKEGSEDENDNEKVESK,ph,S,247,true,"STN8 phosphoproteome",38,21768351,"MASCOT Score",95.4700000,,,,,,-1.4362000
VEDEKEGSEDENDNEKVESK,ph,S,247,true,"Chloroplast kinase substrates",60,19376835,"MASCOT Score",72.6500000,,,,,,-0.9217650
VEDEKEGSEDENDNEKVESK,ph,S,247,true,"LAXIC - mannitol vs control",84b,23660473,XCorr,4.6900000,1.0000000,-1.4275492,,NO,7.4899998026012E-7,
VEDEKEGSEDENDNEKVESK,ph,S,247,true,"SnRK2 protein kinase substrates",85,23776212,XCorr,4.5198317,1.0000000,,,,1.2742799870846E-11,
VEDEKEGSEDENDNEKVESK,ph,S,247,true,"atm and atr DNA damage response",88,25561503,"MASCOT Score",43.0000000,1.0000000,,,,,2.3000000
VEDEKEGSEDENDNEKVESK,ph,S,247,true,"Phospho cell culture sucrose/TOR",109,30833711,,,1.0000000,,,,,
VEDEKEGSEDENDNEKVESK,ph,S,247,true,"Tissue atlas Arabidopsis - ProteomicsDB",114,32188942,"MaxQuant score",419.4300000,1.0000000,,,,0,
VEDEKEGSEDENDNEK,ph,S,247,true,"STN8 phosphoproteome",38,21768351,"MASCOT Score",101.3500000,,,,,,-1.0573600
VEDEKEGSEDENDNEK,ph,S,247,true,"Chloroplast kinase substrates",60,19376835,"MASCOT Score",85.5400000,,,,,,-1.5607700
VEDEKEGSEDENDNEK,ph,S,247,true,"SnRK2 protein kinase substrates",85,23776212,XCorr,4.3575602,1.0000000,,,,0.00078768999082968,
VEDEKEGSEDENDNEK,ph,S,247,true,"atm and atr DNA damage response",88,25561503,"MASCOT Score",39.0000000,1.0000000,,,,,0.0100000
EGSEDENDNEKVESK,ph,S,247,true,"STN8 phosphoproteome",38,21768351,"MASCOT Score",49.8500000,,,,,,-1.7021900
EGSEDENDNEKVESK,ph,S,247,true,"SnRK2 protein kinase substrates",85,23776212,XCorr,2.2830207,1.0000000,,,,0.011405999772251,
EGSEDENDNEK,ph,S,247,true,"STN8 phosphoproteome",38,21768351,"MASCOT Score",46.3800000,,,,,,-0.1220860
EGSEDENDNEK,ph,S,247,true,"Chloroplast kinase substrates",60,19376835,"MASCOT Score",35.1800000,,,,,,-0.1220860
EGSEDENDNEK,ph,S,247,true,"atm and atr DNA damage response",88,25561503,"MASCOT Score",54.0000000,1.0000000,,,,,-0.0200000
GKGTSSGGKVR,ub,K,288,true,"Arabidopsis ubiquitination COFRADIC",40,26744219,"MaxQuant Score",94.7670000,1.0000000,,,,1.4529999425861E-10,-0.0360000
GKGTSSGGKVR,ub,K,295,true,"Arabidopsis ubiquitination COFRADIC",40,26744219,"MaxQuant Score",94.7670000,1.0000000,,,,1.4529999425861E-10,-0.0360000
EKNKTEEVKKDAEPR,ub,K,299,true,"Arabidopsis ubiquitination COFRADIC",40,26744219,"MaxQuant Score",127.8300000,1.0000000,,,,1.9249999957091E-23,-0.7610000
EKNKTEEVKKDAEPR,ub,K,306,true,"Arabidopsis ubiquitination COFRADIC",40,26744219,"MaxQuant Score",127.8300000,0.9650000,,,,1.9249999957091E-23,-0.7610000
EKNKTEEVKKDAEPR,ub,K,307,true,"Arabidopsis ubiquitination COFRADIC",40,26744219,"MaxQuant Score",68.4810000,0.8810000,,,,7.3500000326021E-6,-1.0420000
DAEPRTPFSDRPVR,ph,T,313,true,"srk2dei ABA signaling phopshoproteomics",83,23572148,"MASCOT Score",32.0000000,,,,,,0.0002000
DAEPRTPFSDRPVR,ph,T,313,true,"TOR Kinase and ABA Receptor",100,29290610,XCorr,2.5927241,0.9817000,,,,0.013609999790788,
DAEPRTPFSDR,ph,T,313,true,"atm and atr DNA damage response",88,25561503,"MASCOT Score",21.0000000,1.0000000,,,,,0.2500000
TPFSDRPVR,ph,T,313,true,"Tissue atlas Arabidopsis - ProteomicsDB",114,32188942,"MaxQuant score",149.5200000,1.0000000,,,,1.7815999342474E-7,
DAEPRTPFSDRPVR,ph,S,316,true,"Tissue atlas Arabidopsis - ProteomicsDB",114,32188942,"MaxQuant score",79.8200000,1.0000000,,,,0.0012297299690545,
LVALIDKDSSKEFR,ub,K,335,true,"Arabidopsis ubiquitination COFRADIC",40,26744219,"MaxQuant Score",43.7610000,0.9840000,,,,0.0010000000474975,1.4090000
LVALIDKDSSK,ph,S,337,true,"atm and atr DNA damage response",88,25561503,"MASCOT Score",24.0000000,0.9160000,,,,,-1.5000000
LVALIDKDSSKEFR,ub,K,339,true,"Arabidopsis ubiquitination COFRADIC",40,26744219,"MaxQuant Score",79.8750000,0.9870000,,,,5.7659999583848E-5,1.0900000
KEDIITK,ph,T,446,true,"Tissue atlas Arabidopsis - ProteomicsDB",114,32188942,"MaxQuant score",83.8620000,1.0000000,,,,0.0097991395741701,
KTSPTAGSSSSKR,ph,S,487,true,"SnRK2 protein kinase substrates",85,23776212,XCorr,2.0596840,0.8290000,,,,0.020583499222994,
KTSPTAGSSSSK,ph,S,487,true,"atm and atr DNA damage response",88,25561503,"MASCOT Score",60.0000000,0.9940000,,,,,-2.1600000
TSPTAGSSSSK,ph,S,487,true,"atm and atr DNA damage response",88,25561503,"MASCOT Score",62.0000000,0.8730000,,,,,-0.7600000
KTSPTAGSSSSK,ph,T,489,true,"atm and atr DNA damage response",88,25561503,"MASCOT Score",54.0000000,0.9820000,,,,,-1.6700000
KTSPTAGSSSSKR,ac,K,496,true,"Quantitative Acetylproteomics",101,29440448,,,,,,,,
TSPTAGSSSSKR,ac,K,496,true,"Quantitative Acetylproteomics",101,29440448,,,,,,,,
TPKKTSPTAGSSSSKR,ub,K,496,true,"Arabidopsis ubiquitination COFRADIC",40,26744219,"MaxQuant Score",80.7380000,1.0000000,,,,1.9879999868522E-9,0.0630000
KSEEATKVVK,ac,K,510,true,"Quantitative Acetylproteomics",101,29440448,,,,,,,,
SEEATKVVK,ac,K,510,true,"Histone deacetylases - apicidin vs control",98a,29061669,"MaxQuant Score",151.2000000,1.0000000,0.2890000,0.2691535,NO,3.4999999343199E-8,
SEEATKVVK,ac,K,510,true,"Histone deacetylases- hda14 vs WT (low light)",98c,29061669,"MaxQuant Score",143.9600000,1.0000000,0.8250000,0.9885531,NO,0.0007999999797903,
SEEATKVVK,ac,K,510,true,"Quantitative Acetylproteomics",101,29440448,,,,,,,,
SLAHSDDESEEEKEEEEKQEEEK,ph,S,515,true,"srk2dei ABA signaling phopshoproteomics",83,23572148,"MASCOT Score",42.0000000,,,,,,-0.0079000
SLAHSDDESEEEKEEEEKQEEEK,ph,S,519,true,"srk2dei ABA signaling phopshoproteomics",83,23572148,"MASCOT Score",47.0000000,,,,,,-0.0015000
SLAHSDDESEEEKEEEEKQEEEK,ph,S,519,true,"LAXIC - mannitol vs control",84b,23660473,XCorr,4.2100000,0.7920000,,,,1.0400000064692E-5,
SLAHSDDESEEEKEEEEKQEEEK,ph,S,519,true,"TOR Kinase and ABA Receptor",100,29290610,XCorr,5.7850609,0.8530000,,,,2.7940000109083E-6,
KSLAHSDDESEEEKEEEEK,ph,S,519,true,"STN8 phosphoproteome",38,21768351,"MASCOT Score",53.6000000,,,,,,
KSLAHSDDESEEEKEEEEK,ph,S,519,true,"TOR Kinase and ABA Receptor",100,29290610,XCorr,4.9969816,0.9594000,,,,0.010089999996126,
SLAHSDDESEEEKEEEEK,ph,S,519,true,"STN8 phosphoproteome",38,21768351,"MASCOT Score",62.6100000,,,,,,
SLAHSDDESEEEKEEEEK,ph,S,519,true,"Chloroplast kinase substrates",60,19376835,"MASCOT Score",42.2100000,,,,,,-0.6766130
SLAHSDDESEEEKEEEEK,ph,S,519,true,"srk2dei ABA signaling phopshoproteomics",83,23572148,"MASCOT Score",52.0000000,,,,,,-0.0017000
SLAHSDDESEEEKEEEEK,ph,S,519,true,"LAXIC - mannitol vs control",84b,23660473,XCorr,2.4100000,0.8830000,,,,2.1700000019109E-8,
SLAHSDDESEEEKEEEEK,ph,S,519,true,"Brassinosteroid-Regulated Phosphorylation Dynamics",94,26187819,"MaxQuant Score",150.9100000,1.0000000,,,,5.3330001037466E-7,0.6360000
SLAHSDDESEEEKEEEEK,ph,S,519,true,"TOR Kinase and ABA Receptor",100,29290610,XCorr,5.2256784,0.9842000,,,,3.4860000596382E-5,
SLAHSDDESEEEKEEEEK,ph,S,519,true,"Phospho cell culture sucrose/TOR",109,30833711,,,1.0000000,,,,,
KSLAHSDDESEEEK,ph,S,519,true,"STN8 phosphoproteome",38,21768351,"MASCOT Score",63.7700000,,,,,,
KSLAHSDDESEEEK,ph,S,519,true,"Chloroplast kinase substrates",60,19376835,"MASCOT Score",64.4500000,,,,,,-1.2480600
SLAHSDDESEEEK,ph,S,519,true,"STN8 phosphoproteome",38,21768351,"MASCOT Score",56.8800000,,,,,,
SLAHSDDESEEEK,ph,S,519,true,"Chloroplast kinase substrates",60,19376835,"MASCOT Score",49.1600000,,,,,,-1.0542800
SLAHSDDESEEEK,ph,S,519,true,"TOR Kinase and ABA Receptor",100,29290610,XCorr,4.4340539,0.9768000,,,,0.00060989998746663,
SLAHSDDESEEEK,ph,S,519,true,"Tissue atlas Arabidopsis - ProteomicsDB",114,32188942,"MaxQuant score",206.9600000,0.9999980,,,,0,
SLAHSDDESEEEKEEEEKQEEEK,ph,S,523,true,"srk2dei ABA signaling phopshoproteomics",83,23572148,"MASCOT Score",58.0000000,,,,,,-0.0019000
SLAHSDDESEEEKEEEEKQEEEK,ph,S,523,true,"LAXIC - mannitol vs control",84b,23660473,XCorr,3.4000000,0.9820000,,,,0.00047802401240915,
SLAHSDDESEEEKEEEEKQEEEK,ph,S,523,true,"TOR Kinase and ABA Receptor",100,29290610,XCorr,4.7116451,0.9996000,,,,5.5550000979565E-5,
KSLAHSDDESEEEKEEEEK,ph,S,523,true,"TOR Kinase and ABA Receptor",100,29290610,XCorr,4.9969816,0.9992000,,,,0.010089999996126,
SLAHSDDESEEEKEEEEK,ph,S,523,true,"Chloroplast kinase substrates",60,19376835,"MASCOT Score",42.2100000,,,,,,-0.6766130
SLAHSDDESEEEKEEEEK,ph,S,523,true,"srk2dei ABA signaling phopshoproteomics",83,23572148,"MASCOT Score",52.0000000,,,,,,-0.0017000
SLAHSDDESEEEKEEEEK,ph,S,523,true,"LAXIC - mannitol vs control",84b,23660473,XCorr,2.4100000,1.0000000,,,,2.1700000019109E-8,
SLAHSDDESEEEKEEEEK,ph,S,523,true,"Brassinosteroid-Regulated Phosphorylation Dynamics",94,26187819,"MaxQuant Score",150.9100000,1.0000000,,,,5.3330001037466E-7,0.6360000
SLAHSDDESEEEKEEEEK,ph,S,523,true,"TOR Kinase and ABA Receptor",100,29290610,XCorr,5.4792166,1.0000000,,,,4.9900000931302E-7,
KSLAHSDDESEEEK,ph,S,523,true,"Chloroplast kinase substrates",60,19376835,"MASCOT Score",64.4500000,,,,,,-1.2480600
SLAHSDDESEEEK,ph,S,523,true,"Chloroplast kinase substrates",60,19376835,"MASCOT Score",49.1600000,,,,,,-1.0542800
SLAHSDDESEEEK,ph,S,523,true,"TOR Kinase and ABA Receptor",100,29290610,XCorr,4.4340539,0.9990000,,,,0.00060989998746663,
SLAHSDDESEEEK,ph,S,523,true,"Tissue atlas Arabidopsis - ProteomicsDB",114,32188942,"MaxQuant score",206.9600000,1.0000000,,,,0,
KEEENENGIPDKSEDEAPQPSESEEK,ph,S,557,true,"STN8 phosphoproteome",38,21768351,"MASCOT Score",49.1900000,,,,,,
KEEENENGIPDKSEDEAPQPSESEEK,ph,S,557,true,"Chloroplast kinase substrates",60,19376835,"MASCOT Score",36.5700000,,,,,,-0.9575410
KEEENENGIPDKSEDEAPQPSESEEK,ph,S,557,true,"TOR Kinase and ABA Receptor",100,29290610,XCorr,6.7836637,1.0000000,,,,6.6859996877611E-5,
SEDEAPQPSESEEKDESEEHSEEETTK,ph,S,565,true,"TOR Kinase and ABA Receptor",100,29290610,XCorr,5.0565696,0.9999000,,,,4.9769998440752E-5,
KEEENENGIPDKSEDEAPQPSESEEK,ph,S,565,true,"STN8 phosphoproteome",38,21768351,"MASCOT Score",53.0800000,,,,,,
KEEENENGIPDKSEDEAPQPSESEEK,ph,S,565,true,"Chloroplast kinase substrates",60,19376835,"MASCOT Score",43.1900000,,,,,,-0.5414650
KEEENENGIPDKSEDEAPQPSESEEK,ph,S,565,true,"TOR Kinase and ABA Receptor",100,29290610,XCorr,6.7836637,1.0000000,,,,6.6859996877611E-5,
EEENENGIPDKSEDEAPQPSESEEK,ph,S,565,true,"STN8 phosphoproteome",38,21768351,"MASCOT Score",46.5100000,,,,,,
EEENENGIPDKSEDEAPQPSESEEK,ph,S,565,true,"Chloroplast kinase substrates",60,19376835,"MASCOT Score",41.4200000,,,,,,-0.7974500
SEDEAPQPSESEEK,ph,S,565,true,"TOR Kinase and ABA Receptor",100,29290610,XCorr,4.1715231,0.9242000,,,,1.3679999938176E-5,
SEDEAPQPSESEEKDESEEHSEEETTK,ph,S,567,true,"TOR Kinase and ABA Receptor",100,29290610,XCorr,5.0565696,0.9999000,,,,4.9769998440752E-5,
KEEENENGIPDKSEDEAPQPSESEEK,ph,S,567,true,"Chloroplast kinase substrates",60,19376835,"MASCOT Score",43.1900000,,,,,,-0.5414650
KEEENENGIPDKSEDEAPQPSESEEK,ph,S,567,true,"TOR Kinase and ABA Receptor",100,29290610,XCorr,6.7836637,1.0000000,,,,6.6859996877611E-5,
EEENENGIPDKSEDEAPQPSESEEK,ph,S,567,true,"Chloroplast kinase substrates",60,19376835,"MASCOT Score",41.4200000,,,,,,-0.7974500
SEDEAPQPSESEEK,ph,S,567,true,"TOR Kinase and ABA Receptor",100,29290610,XCorr,3.3450532,1.0000000,,,,0.020999999716878,
DESEEHSEEETTKK,ph,S,573,true,"Tissue atlas Arabidopsis - ProteomicsDB",114,32188942,"MaxQuant score",69.9860000,0.9999860,,,,0.0003583230136428,
DESEEHSEEETTKK,ph,S,577,true,"Tissue atlas Arabidopsis - ProteomicsDB",114,32188942,"MaxQuant score",69.9860000,0.9925600,,,,0.0003583230136428,
LSAGKKESAGR,ub,K,594,true,"Arabidopsis ubiquitination COFRADIC",40,26744219,"MaxQuant Score",88.3380000,1.0000000,,,,0.00028999999631196,-0.0920000
LSAGKKESAGR,ub,K,595,true,"Arabidopsis ubiquitination COFRADIC",40,26744219,"MaxQuant Score",88.3380000,1.0000000,,,,0.00028999999631196,-0.0920000
AVVAAKSSPPEK,ac,K,611,true,"Quantitative Acetylproteomics",101,29440448,,,,,,,,
AVVAAKSSPPEKITQK,ph,S,613,true,"Phosphoproteome ethylene-regulated time response",46,24043427,"MASCOT Score",27.1700000,,,,,,2.2075000
AVVAAKSSPPEK,ph,S,613,true,"Phosphoproteome ethylene-regulated time response",46,24043427,"MASCOT Score",43.3400000,,,,,,15.4842000
TDDDSDTSPKASSKR,ph,S,634,true,"STN8 phosphoproteome",38,21768351,"MASCOT Score",52.1500000,,,,,,-0.0578784
KTDDDSDTSPKASSK,ph,S,634,true,"STN8 phosphoproteome",38,21768351,"MASCOT Score",43.8900000,,,,,,0.3150120
KKTDDDSDTSPK,ph,S,634,true,"SnRK2 protein kinase substrates",85,23776212,XCorr,4.3343825,1.0000000,,,,0.000952574016992,
KKTDDDSDTSPK,ph,S,634,true,"Tissue atlas Arabidopsis - ProteomicsDB",114,32188942,"MaxQuant score",117.0000000,0.9947420,,,,1.3103100172884E-5,
KTDDDSDTSPK,ph,S,634,true,"SnRK2 protein kinase substrates",85,23776212,XCorr,3.7344871,1.0000000,,,,0.0050138900987804,
KTDDDSDTSPK,ph,S,634,true,"atm and atr DNA damage response",88,25561503,"MASCOT Score",46.0000000,1.0000000,,,,,0.0300000
TDDDSDTSPK,ph,S,634,true,"SnRK2 protein kinase substrates",85,23776212,XCorr,4.1656718,1.0000000,,,,0.01274329982698,
TDDDSDTSPK,ph,S,634,true,"atm and atr DNA damage response",88,25561503,"MASCOT Score",53.0000000,1.0000000,,,,,0.0400000
TDDDSDTSPKASSK,ph,T,636,true,"atm and atr DNA damage response",88,25561503,"MASCOT Score",30.0000000,0.9440000,,,,,1.0400000
KTDDDSDTSPK,ph,T,636,true,"atm and atr DNA damage response",88,25561503,"MASCOT Score",22.0000000,0.9930000,,,,,-1.0100000
TDDDSDTSPKASSK,ph,S,637,true,"atm and atr DNA damage response",88,25561503,"MASCOT Score",30.0000000,1.0000000,,,,,1.0400000
KTDDDSDTSPK,ph,S,637,true,"atm and atr DNA damage response",88,25561503,"MASCOT Score",22.0000000,0.9950000,,,,,-0.9700000
KSENPIKASPAPSK,ph,S,654,true,"Tissue atlas Arabidopsis - ProteomicsDB",114,32188942,"MaxQuant score",223.5400000,1.0000000,,,,0,
SENPIKASPAPSK,ph,S,654,true,"STN8 phosphoproteome",38,21768351,"MASCOT Score",57.4100000,,,,,,-1.0218300
SENPIKASPAPSK,ph,S,654,true,"Chloroplast kinase substrates",60,19376835,"MASCOT Score",33.7000000,,,,,,-0.7232510
SENPIKASPAPSK,ph,S,654,true,"SnRK2 protein kinase substrates",85,23776212,XCorr,2.9635601,1.0000000,,,,1.567850027584E-8,
SENPIKASPAPSK,ph,S,654,true,"atm and atr DNA damage response",88,25561503,"MASCOT Score",56.0000000,1.0000000,,,,,-1.1200000
ASPAPSKSASK,ac,K,659,true,"Quantitative Acetylproteomics",101,29440448,,,,,,,,
ASPAPSKSASK,ph,S,660,true,"atm and atr DNA damage response",88,25561503,"MASCOT Score",29.0000000,0.9430000,,,,,-1.8400000
VLKNAIVEILK,ac,K,683,true,"Quantitative Acetylproteomics",101,29440448,,,,,,,,
NAIVEILKR,ac,K,691,true,"Quantitative Acetylproteomics",101,29440448,,,,,,,,
EFTEDLTPR,ph,T,716,true,"atm and atr DNA damage response",88,25561503,"MASCOT Score",42.0000000,1.0000000,,,,,-1.1800000
EFTEDLTPR,ph,T,716,true,"Phospho cell culture sucrose/TOR",109,30833711,,,1.0000000,,,,,
EFTEDLTPR,ph,T,716,true,"Tissue atlas Arabidopsis - ProteomicsDB",114,32188942,"MaxQuant score",144.1700000,1.0000000,,,,0.00024130700330716,
EEDSEKEEAGGSGGGEEVKA,ph,S,747,true,"STN8 phosphoproteome",38,21768351,"MASCOT Score",103.3400000,,,,,,-0.8257980
EEDSEKEEAGGSGGGEEVKA,ph,S,747,true,"Chloroplast kinase substrates",60,19376835,"MASCOT Score",77.4500000,,,,,,-1.3077700
EEDSEKEEAGGSGGGEEVKA,ph,S,747,true,"TOR Kinase and ABA Receptor",100,29290610,XCorr,2.2987013,0.9443000,,,,0.0048010000027716,
KEEDSEKEEAGGSGGGEEVK,ph,S,747,true,"STN8 phosphoproteome",38,21768351,"MASCOT Score",87.5200000,,,,,,-0.6319670
KEEDSEKEEAGGSGGGEEVK,ph,S,747,true,"Chloroplast kinase substrates",60,19376835,"MASCOT Score",63.1100000,,,,,,-0.4209850
KEEDSEKEEAGGSGGGEEVK,ph,S,747,true,"TOR Kinase and ABA Receptor",100,29290610,XCorr,4.8298297,0.9937000,,,,0.001304000033997,
EEDSEKEEAGGSGGGEEVK,ph,S,747,true,"STN8 phosphoproteome",38,21768351,"MASCOT Score",82.1600000,,,,,,-0.8121550
EEDSEKEEAGGSGGGEEVK,ph,S,747,true,"Chloroplast kinase substrates",60,19376835,"MASCOT Score",68.9900000,,,,,,-1.3112100
EEDSEKEEAGGSGGGEEVK,ph,S,747,true,"TOR Kinase and ABA Receptor",100,29290610,XCorr,3.6636436,1.0000000,,,,2.5330000426038E-5,
LADEEEEEEKKEEDSEK,ph,S,747,true,"Chloroplast kinase substrates",60,19376835,"MASCOT Score",39.3600000,,,,,,-1.8096600
LADEEEEEEKKEEDSEK,ph,S,747,true,"srk2dei ABA signaling phopshoproteomics",83,23572148,"MASCOT Score",40.0000000,,,,,,-0.0011000
LADEEEEEEKKEEDSEK,ph,S,747,true,"TOR Kinase and ABA Receptor",100,29290610,XCorr,4.5694799,1.0000000,,,,5.3539999498753E-5,
LADEEEEEEKKEEDSEK,ph,S,747,true,"Tissue atlas Arabidopsis - ProteomicsDB",114,32188942,"MaxQuant score",177.5300000,1.0000000,,,,3.4003899566996E-37,
KEEDSEKEEAGGSGGGEEVK,ph,S,755,true,"TOR Kinase and ABA Receptor",100,29290610,XCorr,4.4969497,1.0000000,,,,1.3650000255438E-5,
EEAGGSGGGEEVKA,ph,S,755,true,"STN8 phosphoproteome",38,21768351,"MASCOT Score",75.0100000,,,,,,0.0984264
EEAGGSGGGEEVKA,ph,S,755,true,"Chloroplast kinase substrates",60,19376835,"MASCOT Score",68.4300000,,,,,,0.0984264
EEAGGSGGGEEVKA,ph,S,755,true,"Tissue atlas Arabidopsis - ProteomicsDB",114,32188942,"MaxQuant score",105.5800000,1.0000000,,,,2.8958400434931E-5,
