Peptide,PTM,ModifiedAA,ModifiedPosition,PeptideUniqueToGene,ExperimentDesc,ExpID,PubmedID,ScoreType,IdentScore,LocProb,Log2FChange,PQ-val,QuantSig,PEP,MassErrorPPM
SNTCRPSTSSDISDESTCSSFSGNNKPHK,ph,S,77,true,"Tissue atlas Arabidopsis - ProteomicsDB",114,32188942,"MaxQuant score",261.2900000,0.8072350,,,,0,
SNTCRPSTSSDISDESTCSSFSGNNKPHK,ph,S,80,true,"Tissue atlas Arabidopsis - ProteomicsDB",114,32188942,"MaxQuant score",117.8000000,0.8210670,,,,5.6818500250094E-33,
SNTCRPSTSSDISDESTCSSFSGNNKPHK,ph,S,83,true,"Tissue atlas Arabidopsis - ProteomicsDB",114,32188942,"MaxQuant score",52.8580000,0.9311210,,,,6.2938503106125E-5,
NETGNQVSPLPELVAEPTSAR,ph,S,350,true,"TOR Kinase and ABA Receptor",100,29290610,XCorr,3.7097726,0.8880000,,,,0.00065040000481531,
SMSFVGTHEYLAPEIIK,ph,S,353,false,"Phosphorylation Early Elicitor Signaling",23,17317660,,,,,,,,
SMSFVGTHEYLAPEIIK,ph,S,353,false,"Lateral root-induction - NAA vs control",106,23328941,"MASCOT Score",41.0000000,,,,,,
SMSFVGTHEYLAPEIIK,ph,S,353,false,"Phosphorylation tonoplast membrane fraction",107,18686298,"MASCOT Score",51.0000000,,,,,,
SMSFVGTHEYLAPEIIK,ph,S,353,false,"Tissue atlas Arabidopsis - ProteomicsDB",114,32188942,"MaxQuant score",209.2500000,0.9631280,,,,0,
SMSFVGTHEYLAPEIIK,ph,S,355,false,"Arabidopsis root NAA phosphoproteome",18a,27643528,"MaxQuant Score",98.5430000,0.9580000,,,,1.1639999727975E-11,0.3950000
SMSFVGTHEYLAPEIIK,ph,S,355,false,"MAPK Arabidopsis substrates",45,23172892,"MaxQuant Score",166.0400000,,,,,,
SMSFVGTHEYLAPEIIK,ph,S,355,false,"Phosphoproteome ethylene-regulated time response",46,24043427,"MASCOT Score",104.1200000,,,,,,-4.6344000
SMSFVGTHEYLAPEIIK,ph,S,355,false,"PAMP-triggered phosphorylation",48,24601666,"MASCOT Score",23.8400000,,,,,,
SMSFVGTHEYLAPEIIK,ph,S,355,false,"srk2dei ABA signaling phopshoproteomics",83,23572148,"MASCOT Score",67.0000000,,,,,,-0.0011000
SMSFVGTHEYLAPEIIK,ph,S,355,false,"SnRK2 protein kinase substrates",85,23776212,XCorr,3.4767542,0.9090000,,,,0.00037180300569162,
SMSFVGTHEYLAPEIIK,ph,S,355,false,"atm and atr DNA damage response",88,25561503,"MASCOT Score",46.0000000,0.9970000,,,,,-0.8700000
SMSFVGTHEYLAPEIIK,ph,S,355,false,"TOR Kinase and ABA Receptor",100,29290610,XCorr,3.9828887,0.9920000,,,,6.5260001065326E-6,
SMSFVGTHEYLAPEIIK,ph,S,355,false,"Lateral root-induction - NAA vs control",106,23328941,"MASCOT Score",31.0000000,,,,,,
SMSFVGTHEYLAPEIIK,ph,S,355,false,"Phosphorylation tonoplast membrane fraction",107,18686298,"MASCOT Score",51.0000000,,,,,,
SMSFVGTHEYLAPEIIK,ph,S,355,false,"Phospho cell culture sucrose/TOR",109,30833711,,,0.9982700,,,,,
SMSFVGTHEYLAPEIIK,ph,S,355,false,"Tissue atlas Arabidopsis - ProteomicsDB",114,32188942,"MaxQuant score",356.3100000,0.9999950,,,,0,
CASPPEIPKPVDYESAPATPAAATSTSVK,sno,C,466,true,"hot5-4 / wildtype, FAT-switch S-nitrosoproteome",169,37277371,,,,,,,,
CASPPEIPKPVDYESAPATPAAATSTSVK,ph,S,480,true,"Tissue atlas Arabidopsis - ProteomicsDB",114,32188942,"MaxQuant score",66.1730000,0.9563740,,,,3.021930012892E-7,
CASPPEIPKPVDYESAPATPAAATSTSVK,ph,T,484,true,"Tissue atlas Arabidopsis - ProteomicsDB",114,32188942,"MaxQuant score",59.9930000,0.9505560,,,,1.1362500345058E-6,
