Peptide,PTM,ModifiedAA,ModifiedPosition,PeptideUniqueToGene,ExperimentDesc,ExpID,PubmedID,ScoreType,IdentScore,LocProb,Log2FChange,PQ-val,QuantSig,PEP,MassErrorPPM
CFDIDIYK,acy,C,18,true,"Arabidopsis S-acylation atlas - Hypocotyl",163b,35681017,,,,,,,,
CFDIDIYK,acy,C,18,true,"Arabidopsis S-acylation atlas - Leaf",163c,35681017,,,,,,,,
CFDIDIYK,acy,C,18,true,"Arabidopsis S-acylation atlas - Silique",163e,35681017,,,,,,,,
CFDIDIYK,acy,C,18,true,"Arabidopsis S-acylation atlas - Stem",163f,35681017,,,,,,,,
KISSAVIDDGLINKEEFQLALFK,ub,K,56,false,"upl3 mutant / wildtype",168,35926874,"MaxQuant score",119.4500000,1.0000000,-0.3075728,0.7721000,NO,1.689899956081E-11,0.0862450
HPSLLKNMTLQYLK,ub,K,200,false,"Ubiquitination Membrane Proteins",120,33585938,,,,,,,,
HPSLLKNMTLQYLK,ub,K,200,false,"upl3 mutant / wildtype",168,35926874,"MaxQuant score",194.7700000,1.0000000,-0.8059129,0.2269000,NO,5.0353701555072E-23,1.2845000
DITTTFPSFVFHSQVEDT,ph,S,216,false,"Large-scale phosphorylation discovery",44,23111157,XCorr,3.4200000,,,,,,
DITTTFPSFVFHSQVEDT,ph,S,216,false,"TOR Kinase and ABA Receptor",100,29290610,XCorr,4.0760403,0.9854000,,,,0.0019399999873713,
DITTTFPSFVFHSQVEDT,ph,S,221,false,"Large-scale phosphorylation discovery",44,23111157,XCorr,3.1290000,,,,,,
