Peptide,PTM,ModifiedAA,ModifiedPosition,PeptideUniqueToGene,ExperimentDesc,ExpID,PubmedID,ScoreType,IdentScore,LocProb,Log2FChange,PQ-val,QuantSig,PEP,MassErrorPPM
SAFVGKYADELIKTAKYIATPGKGILAADESTGTIGKR,nt,S,2,true,"Stromal N-terminome",96,26371235,"MASCOT Score",40.6500000,,,,,,
SAFVGKYADELIKTAKY,nt,S,2,true,"Stromal N-terminome",96,26371235,"MASCOT Score",44.0300000,,,,,,
SAFVGKYADELIKTAK,nt,S,2,true,"Stromal N-terminome",96,26371235,"MASCOT Score",73.2300000,,,,,,
SAFVGKYADELIK,nt,S,2,true,"Stromal N-terminome",96,26371235,"MASCOT Score",71.8600000,,,,,,
SAFVGKYADE,nt,S,2,true,"N-term acetylation drought responses",5,26184543,,,,,,,,
SAFVGKYADELIKTAKYIATPGKGILAADESTGTIGKR,nta,S,2,true,"Stromal N-terminome",96,26371235,"MASCOT Score",40.6500000,,,,,,
SAFVGKYADELIKTAKY,nta,S,2,true,"Stromal N-terminome",96,26371235,"MASCOT Score",44.0300000,,,,,,
SAFVGKYADELIKTAK,nta,S,2,true,"Stromal N-terminome",96,26371235,"MASCOT Score",73.2300000,,,,,,
SAFVGKYADELIK,nta,S,2,true,"Stromal N-terminome",96,26371235,"MASCOT Score",71.8600000,,,,,,
SAFVGKYADE,nta,S,2,true,"N-term acetylation drought responses",5,26184543,,,,,,,,
SAFVGKYADE,nta,S,2,true,"HUNTER N-terminome: legumain, GluC and trypsin",119,31951383,"MaxQuant score",91.0690000,,,,,,
SAFVGKYAD,nta,S,2,true,"HUNTER N-terminome: legumain, GluC and trypsin",119,31951383,"MaxQuant score",,,,,,,
SAFVGKYADELIK,ub,K,7,true,"upl3 mutant / wildtype",168,35926874,"MaxQuant score",104.8100000,1.0000000,0.6257381,,,4.5489198896576E-7,-1.3767000
YADELIKTAK,ac,K,14,true,"Quantitative Acetylproteomics",101,29440448,,,,,,,,
YADELIKTAK,ub,K,14,true,"upl3 mutant / wildtype",168,35926874,"MaxQuant score",100.8800000,1.0000000,-0.1616533,,,0.0012165399966761,-0.2602100
GILAADESTGTIGKR,nt,G,25,false,"Metacaspase9 substrates - in vitro rMC9",51c,23964026,"MASCOT Score",60.0000000,,,,,,-0.1842890
GILAADESTGTIGKR,ph,S,32,false,"SnRK2 protein kinase substrates",85,23776212,XCorr,3.7794719,0.9360000,,,,1.8062699773391E-12,
GILAADESTGTIGKR,ph,S,32,false,"atm and atr DNA damage response",88,25561503,"MASCOT Score",47.0000000,1.0000000,,,,,-1.1100000
GILAADESTGTIGKR,ph,S,32,false,"Phospho cell culture sucrose/TOR",109,30833711,,,0.8978180,,,,,
GILAADESTGTIGKR,ph,S,32,false,"Tissue atlas Arabidopsis - ProteomicsDB",114,32188942,"MaxQuant score",231.9200000,0.9823370,,,,0,
GILAADESTGTIGKR,ph,S,32,false,"Touch-induced phosphorylation: 40s touch vs untouc",136,30291188,"MASCOT score",80.1400000,,-0.0185231,0.8771044,NO,,5.4425481
GILAADESTGTIGK,ph,S,32,false,"Tyrosine phosphorylation in Arabidopsis",59,18463617,"MASCOT Score",75.0000000,,,,,,-0.7083867
GILAADESTGTIGK,ph,S,32,false,"srk2dei ABA signaling phopshoproteomics",83,23572148,"MASCOT Score",88.0000000,,,,,,-0.0002000
GILAADESTGTIGK,ph,S,32,false,"Lateral root-induction - NAA vs control",106,23328941,"MASCOT Score",25.0000000,,,,,,
GILAADESTGTIGK,ph,T,33,false,"srk2dei ABA signaling phopshoproteomics",83,23572148,"MASCOT Score",81.0000000,,,,,,-0.0004000
GILAADESTGTIGK,ph,T,33,false,"Tissue atlas Arabidopsis - ProteomicsDB",114,32188942,"MaxQuant score",277.8200000,0.9162320,,,,0,
GILAADESTGTIGKR,ph,T,35,false,"Large-scale phosphorylation discovery",44,23111157,XCorr,2.7640000,,,,,,
GILAADESTGTIGKR,ph,T,35,false,"Phosphoproteome ethylene-regulated time response",46,24043427,"MASCOT Score",85.5800000,,,,,,6.2739000
GILAADESTGTIGKR,ph,T,35,false,"atm and atr DNA damage response",88,25561503,"MASCOT Score",89.0000000,0.9990000,,,,,0.4700000
GILAADESTGTIGKR,ph,T,35,false,"Col-0 callus - FC Col-0 vs. Col-0 Xray",111a,31410901,,66.3800000,,0.0510244,0.0000000,NO,,0.9658587
GILAADESTGTIGKR,ph,T,35,false,"Col-0 X-ray callus - FC Col-0 vs. Col-0 Xray",111b,31410901,,66.3800000,,0.0510244,0.0000000,NO,,0.9658587
GILAADESTGTIGKR,ph,T,35,false,"atm callus - FC atm vs. atm Xray",111c,31410901,,66.3800000,,-0.4028604,0.0000000,NO,,0.9658587
GILAADESTGTIGKR,ph,T,35,false,"atm-3 X-ray callus - FC atm vs. atm Xray",111d,31410901,,66.3800000,,-0.4028604,0.0000000,NO,,0.9658587
GILAADESTGTIGKR,ph,T,35,false,"Tissue atlas Arabidopsis - ProteomicsDB",114,32188942,"MaxQuant score",283.1000000,0.9977480,,,,0,
GILAADESTGTIGKR,ph,T,35,false,"Touch-induced phosphorylation: 40s touch vs untouc",136,30291188,"MASCOT score",85.1900000,,-0.0525349,0.7360073,NO,,5.4425481
GILAADESTGTIGK,ph,T,35,false,"Arabidopsis root NAA phosphoproteome",18a,27643528,"MaxQuant Score",108.7100000,0.9270000,,,,2.3569999364463E-16,1.3800000
GILAADESTGTIGK,ph,T,35,false,"Tyrosine phosphorylation in Arabidopsis",59,18463617,"MASCOT Score",91.0000000,,,,,,-0.4250318
GILAADESTGTIGK,ph,T,35,false,"srk2dei ABA signaling phopshoproteomics",83,23572148,"MASCOT Score",91.0000000,,,,,,-0.0004000
GILAADESTGTIGK,ph,T,35,false,"atm and atr DNA damage response",88,25561503,"MASCOT Score",88.0000000,0.9420000,,,,,-0.1700000
GILAADESTGTIGK,ph,T,35,false,"TOR Kinase and ABA Receptor",100,29290610,XCorr,5.5064416,0.9957000,,,,3.7250000417544E-8,
GILAADESTGTIGK,ph,T,35,false,"Lateral root-induction - NAA vs control",106,23328941,"MASCOT Score",60.0000000,,,,,,
GILAADESTGTIGK,ph,T,35,false,"Phospho cell culture sucrose/TOR",109,30833711,,,0.9925060,,,,,
GILAADESTGTIGK,ph,T,35,false,"Touch-induced phosphorylation: 40s touch vs untouc",136,30291188,"MASCOT score",85.2900000,,-0.0280345,0.9715362,NO,,9.4992545
GILAADESTGTIGKR,ac,K,38,false,"Quantitative Acetylproteomics",101,29440448,,,,,,,,
GILAADESTGTIGKR,cr,K,38,false,"Open search Plant PTM Viewer 2.0 - Crotonylation",164c,TBA,,,,,,,,
GILAADESTGTIGKR,ub,K,38,false,"Ubiquitination Membrane Proteins",120,33585938,,,,,,,,
GILAADESTGTIGKR,ub,K,38,false,"upl3 mutant / wildtype",168,35926874,"MaxQuant score",170.7900000,1.0000000,0.8890841,0.3713600,NO,2.4776300973111E-21,-0.5096500
RFASINVENIESNR,ph,S,42,true,"srk2dei ABA signaling phopshoproteomics",83,23572148,"MASCOT Score",47.0000000,,,,,,0.0004000
RFASINVENIESNR,ph,S,42,true,"TOR Kinase and ABA Receptor",100,29290610,XCorr,3.9400756,1.0000000,,,,2.6499999421503E-6,
FASINVENIESNR,ph,S,42,true,"STN8 phosphoproteome",38,21768351,"MASCOT Score",82.9900000,,,,,,-2.5718700
FASINVENIESNR,ph,S,42,true,"atm and atr DNA damage response",88,25561503,"MASCOT Score",86.0000000,1.0000000,,,,,-0.5500000
FASINVENIESNR,ph,S,42,true,"Tissue atlas Arabidopsis - ProteomicsDB",114,32188942,"MaxQuant score",209.3900000,1.0000000,,,,4.0415003152423E-39,
FASINVENIESNR,ph,S,42,true,"Touch-induced phosphorylation: 40s touch vs untouc",136,30291188,"MASCOT score",83.5000000,,0.1848513,0.5938245,NO,,9.4795192
GLVPIVEPE,nt,G,177,false,"Arg/N-end rule seed, prt6 vs. Wt",99,29168982,"MASCOT Score",57.5400000,,,,,0.0035119999665767,-1.1699265
ALNDHHVLLEGTLLKPNMVTPGSDSPK,ph,T,230,true,"atm and atr DNA damage response",88,25561503,"MASCOT Score",30.0000000,0.9800000,,,,,-1.8600000
IVFLSGGQSE,nt,I,262,false,"Arg/N-end rule seed, prt6 vs. Wt",99,29168982,"MASCOT Score",34.8500000,,,,,0.00076040002750233,1.1272845
VFLSGGQSE,nt,V,263,false,"Arg/N-end rule seed, prt6 vs. Wt",99,29168982,"MASCOT Score",43.6600000,,,,,0.02318000048399,-0.2764431
FLSGGQSEE,nt,F,264,false,"Arg/N-end rule seed, prt6 vs. Wt",99,29168982,"MASCOT Score",47.2300000,,,,,0.010250000283122,-0.7321417
FLSGGQSE,nt,F,264,false,"Arg/N-end rule seed, prt6 vs. Wt",99,29168982,"MASCOT Score",49.5100000,,,,,0.0094910003244877,0.4503057
FSFGR,ph,S,295,false,"srk2dei ABA signaling phopshoproteomics",83,23572148,"MASCOT Score",27.0000000,,,,,,0.0004000
ALQQSTLKAWAGK,ub,K,306,true,"upl3 mutant / wildtype",168,35926874,"MaxQuant score",100.2200000,1.0000000,0.6986630,,,4.7518700739602E-5,-0.5228200
AWAGKTENVAK,ac,K,311,true,"Quantitative Acetylproteomics",101,29440448,,,,,,,,
TENVAKAQATFLTR,ub,K,317,true,"upl3 mutant / wildtype",168,35926874,"MaxQuant score",104.5500000,1.0000000,0.5955037,0.3941200,NO,5.030939973949E-6,-0.1515200
CKGNSDATLGK,ox,C,326,true,"SPEAR - 10 mM H2O2 / mock",138a,34619326,,,,0.5999542,0.0321673,YES,,
CKGNSDATLGK,ox,C,326,true,"SPEAR - 50 mM H2O2 / mock",138b,34619326,,,,1.4346037,0.0226785,YES,,
CKGNSDATLGK,ph,S,330,true,"atm and atr DNA damage response",88,25561503,"MASCOT Score",35.0000000,1.0000000,,,,,-3.0000000
YTGGASGDSAASESLYEEGYKY,ph,S,345,true,"Tissue atlas Arabidopsis - ProteomicsDB",114,32188942,"MaxQuant score",66.0590000,0.8646210,,,,3.8452300941572E-5,
