Peptide,PTM,ModifiedAA,ModifiedPosition,PeptideUniqueToGene,ExperimentDesc,ExpID,PubmedID,ScoreType,IdentScore,LocProb,Log2FChange,PQ-val,QuantSig,PEP,MassErrorPPM
ASSSPSSYGDLQPIEE,nt,A,67,true,"N-terminal ChaFRADIC",92,26010716,"MASCOT Score",69.0200000,,,,,1.3159999980417E-5,
ASSSPSSYGDLQPIEE,nt,A,67,true,"HUNTER N-terminome: legumain, GluC and trypsin",119,31951383,"MaxQuant score",112.1500000,,,,,,
ASSSPSSYGDLQPIEE,nta,A,67,true,"HUNTER N-terminome: legumain, GluC and trypsin",119,31951383,"MaxQuant score",104.0700000,,,,,,
VEGCVSQVWVR,so,C,131,true,"S-sulfenylation site detection using YAP1C",110,32714340,,,,,,,,
GEEDSSSGESSESSFVSIPETK,ph,S,224,true,"SnRK2 protein kinase substrates",85,23776212,XCorr,3.6830800,0.8560000,,,,3.9791800077182E-7,
GEEDSSSGESSESSFVSIPETK,ph,S,225,true,"LAXIC - mannitol vs control",84b,23660473,XCorr,4.1500000,0.8510000,-1.1232772,,NO,2.5399998944409E-12,
GEEDSSSGESSESSFVSIPETK,ph,S,225,true,"Tissue atlas Arabidopsis - ProteomicsDB",114,32188942,"MaxQuant score",177.4800000,0.8556040,,,,0,
IVSDAFQGKSLVK,ac,K,337,true,"Quantitative Acetylproteomics",101,29440448,,,,,,,,
