Peptide,PTM,ModifiedAA,ModifiedPosition,PeptideUniqueToGene,ExperimentDesc,ExpID,PubmedID,ScoreType,IdentScore,LocProb,Log2FChange,PQ-val,QuantSig,PEP,MassErrorPPM
SLDNGSCSDESVK,ph,S,37,true,"Tissue atlas Arabidopsis - ProteomicsDB",114,32188942,"MaxQuant score",101.5200000,0.9999120,,,,0.00020581799617503,
SLDNGSCSDESVK,ph,S,39,true,"Tissue atlas Arabidopsis - ProteomicsDB",114,32188942,"MaxQuant score",84.1050000,0.9861830,,,,0.00046815199311823,
LLSTSNSVELGKPMSFDSPGDGGGAYSPVLK,ph,S,71,true,"Tissue atlas Arabidopsis - ProteomicsDB",114,32188942,"MaxQuant score",296.5800000,1.0000000,,,,0,
DLVKDTSANMENSK,ph,T,93,true,"Tissue atlas Arabidopsis - ProteomicsDB",114,32188942,"MaxQuant score",101.7500000,0.7706570,,,,0.00063054199563339,
RGLSGVAHSHGK,ph,S,108,true,"TOR Kinase and ABA Receptor",100,29290610,XCorr,2.3827944,1.0000000,,,,0.0032349999528378,
RGLSGVAHSHGK,ph,S,108,true,"Phospho cell culture sucrose/TOR",109,30833711,,,0.9999430,,,,,
GLSGVAHSHGK,ph,S,108,true,"Large-scale phosphorylation discovery",44,23111157,XCorr,2.6240000,,,,,,
GLSGVAHSHGK,ph,S,108,true,"atm and atr DNA damage response",88,25561503,"MASCOT Score",54.0000000,1.0000000,,,,,-0.4300000
GLSGVAHSHGK,ph,S,108,true,"Tissue atlas Arabidopsis - ProteomicsDB",114,32188942,"MaxQuant score",152.3800000,1.0000000,,,,7.9806996566845E-9,
GLSGVAHSHGK,ph,S,113,true,"Tissue atlas Arabidopsis - ProteomicsDB",114,32188942,"MaxQuant score",64.3850000,1.0000000,,,,0.0033216399606317,
SSTVARAPK,ph,T,182,true,"Chloroplast kinase substrates",60,19376835,"MASCOT Score",35.6600000,,,,,,-0.0164235
HRGESVDFEK,ph,S,217,true,"atm and atr DNA damage response",88,25561503,"MASCOT Score",33.0000000,1.0000000,,,,,-0.5600000
HRGESVDFEK,ph,S,217,true,"TOR Kinase and ABA Receptor",100,29290610,XCorr,2.9922059,1.0000000,,,,0.0027000000700355,
HRGESVDFEK,ph,S,217,true,"Tissue atlas Arabidopsis - ProteomicsDB",114,32188942,"MaxQuant score",177.5800000,1.0000000,,,,2.4871999184851E-17,
ENSYSSLESDSR,ph,S,225,true,"Tissue atlas Arabidopsis - ProteomicsDB",114,32188942,"MaxQuant score",112.4400000,0.9973100,,,,5.7201101299142E-5,
SIDNLNSQMK,ph,S,399,true,"Tissue atlas Arabidopsis - ProteomicsDB",114,32188942,"MaxQuant score",94.4650000,1.0000000,,,,0.00066372397122905,
LIDEQESLAEEQTHETLNK,ph,S,409,true,"Tissue atlas Arabidopsis - ProteomicsDB",114,32188942,"MaxQuant score",140.4500000,0.9999830,,,,2.0885500491708E-16,
