Peptide,PTM,ModifiedAA,ModifiedPosition,PeptideUniqueToGene,ExperimentDesc,ExpID,PubmedID,ScoreType,IdentScore,LocProb,Log2FChange,PQ-val,QuantSig,PEP,MassErrorPPM
SVVAMAANEEFTGNLKR,nt,S,49,true,"Arabidopsis translation initiation landscape - NT",167b,35069635,,,,,,,,
SVVAMAANE,nt,S,49,true,"Arg/N-end rule seed, prt6 vs. Wt",99,29168982,"MASCOT Score",52.4700000,,0.1413097,0.0967792,NO,0.0015729999868199,-6.7089642
AANEEFTGNLKR,nt,A,54,true,"Stromal N-terminome",96,26371235,"MASCOT Score",54.5500000,,,,,,
AANEEFTGNLKR,nt,A,54,true,"Arg/N-end rule seed, prt6 vs. Wt",99,29168982,"MASCOT Score",29.8600000,,,,,0.023499999195337,-2.5301379
AANEEFTGNLKRQL,nta,A,54,true,"Arabidopsis translation initiation landscape - NTA",167a,35069635,,,,,,,,
AANEEFTGNLKR,nta,A,54,true,"Arg/N-end rule pathway Roots",80,25728785,"MASCOT Score",54.9800000,,,,,0.00020270000095479,
AANEEFTGNLKR,nta,A,54,true,"Stromal N-terminome",96,26371235,"MASCOT Score",54.5500000,,,,,,
AANEEFTGNLKR,nta,A,54,true,"Arg/N-end rule seed, prt6 vs. Wt",99,29168982,"MASCOT Score",29.8600000,,0.1764156,0.0844131,NO,0.023499999195337,-2.5301379
AANEEFTGNLKR,nta,A,54,true,"HUNTER N-terminome: legumain, GluC and trypsin",119,31951383,"MaxQuant score",61.6500000,,,,,,
AANEEFTGNLK,nta,A,54,true,"Characterization plant N-terminal acetylation",6,22223895,"MASCOT Score",61.7900000,,,,,,
LSVKR,ac,K,181,false,"Lysine acetylation gel-based Arabidopsis",36,21311030,"MASCOT Score",26.0000000,,,,,,-0.0218000
AVVDFSSPNIAK,ph,S,189,false,"Tissue atlas Arabidopsis - ProteomicsDB",114,32188942,"MaxQuant score",147.3300000,0.9505360,,,,9.857959639703E-7,
AVVDFSSPNIAKEMHVGHLR,ac,K,194,false,"Histone deacetylases - apicidin vs control",98a,29061669,"MaxQuant Score",93.8000000,1.0000000,-0.1000000,0.7516229,NO,3.4999999597567E-16,
AVVDFSSPNIAKEMHVGHLR,ac,K,194,false,"Histone deacetylases- hda14 vs WT (low light)",98c,29061669,"MaxQuant Score",157.5400000,1.0000000,-1.0340000,0.9885531,NO,5.900000106529E-12,
AVVDFSSPNIAKEMHVGHLR,ac,K,194,false,"Histone deacetylases substrates - hda14 vs WT",98e,29061669,"MaxQuant Score",60.1000000,1.0000000,0.1150000,0.9078205,NO,1.9999999949505E-6,
ICDISR,so,C,302,true,"Arabidopsis S-sulfenylation chemoproteomics",108,31578252,"pFind PSM Score",0.1759950,,0.7812500,,,,0.6828793
YADLKNNR,ac,K,502,true,"Quantitative Acetylproteomics",101,29440448,,,,,,,,
FYSNCQVNGSPEETSR,sno,C,605,true,"Site-specific nitrosomeproteomic id - gsnor1-3",90a,25699590,XCorr,3.4958296,,,,,3.3279999911429E-7,-4.7712547
FYSNCQVNGSPEETSR,sno,C,605,true,"Site-specific nitrosomeproteomic id - gsnor1-3",90b,25699590,XCorr,3.6100000,,,,,2.461999974912E-5,-7.6800000
LLLCEATAIVMR,ox,C,620,false,"SPEAR - 10 mM H2O2 / mock",138a,34619326,,,,3.2739682,0.0028266,YES,,
LLLCEATAIVMR,so,C,620,false,"Arabidopsis S-sulfenylation chemoproteomics",108,31578252,"pFind PSM Score",0.2085000,,1.1363600,,,,1.5066221
