Peptide,PTM,ModifiedAA,ModifiedPosition,PeptideUniqueToGene,ExperimentDesc,ExpID,PubmedID,ScoreType,IdentScore,LocProb,Log2FChange,PQ-val,QuantSig,PEP,MassErrorPPM
FSSCSR,sno,C,36,true,"hot5-4 / wildtype, FAT-switch S-nitrosoproteome",169,37277371,,,,,,,,
FGRPPSLIDR,ph,S,64,true,"Phosphorylation Early Elicitor Signaling",23,17317660,,,,,,,,
FGRPPSLIDR,ph,S,64,true,"STN8 phosphoproteome",38,21768351,"MASCOT Score",51.8200000,,,,,,-0.3103320
FGRPPSLIDR,ph,S,64,true,"Chloroplast kinase substrates",60,19376835,"MASCOT Score",49.7700000,,,,,,-0.3103320
FGRPPSLIDR,ph,S,64,true,"srk2dei ABA signaling phopshoproteomics",83,23572148,"MASCOT Score",34.0000000,,,,,,0.0005000
FGRPPSLIDR,ph,S,64,true,"SIRK1 phosphorylation",86a,23820729,"MaxQuant Score",123.7500000,1.0000000,,,,0.013000000268221,2.8960000
FGRPPSLIDR,ph,S,64,true,"SIRK1 exp - sirk1 mutant vs WT",86b,23820729,,,,0.2298792,,NO,,
FGRPPSLIDR,ph,S,64,true,"SIRK1 exp - 35S:SIRK1 vs WT",86c,23820729,,,,-0.1204809,,NO,,
FGRPPSLIDR,ph,S,64,true,"atm and atr DNA damage response",88,25561503,"MASCOT Score",37.0000000,1.0000000,,,,,0.3100000
FGRPPSLIDR,ph,S,64,true,"Tissue atlas Arabidopsis - ProteomicsDB",114,32188942,"MaxQuant score",145.2900000,1.0000000,,,,1.2614000297617E-6,
SINFHLYNSPSPESEIHYSGSDPNPNPPPSLLQR,ph,S,71,true,"MAPK Arabidopsis substrates",45,23172892,"MaxQuant Score",67.2830000,,,,,,
SINFHLYNSPSPESEIHYSGSDPNPNPPPSLLQR,ph,S,71,true,"TOR Kinase and ABA Receptor",100,29290610,XCorr,6.0939627,0.9996000,,,,6.6569999512822E-10,
SINFHLYNSPSPESEIHYSGSDPNPNPPPSLLQR,ph,S,71,true,"Tissue atlas Arabidopsis - ProteomicsDB",114,32188942,"MaxQuant score",302.6800000,1.0000000,,,,0,
VKSINMPYFK,ph,S,107,true,"Phosphoproteome iron-deficient Arabidopsis roots",41,22438062,"MASCOT Score",39.6100000,,,,,,
VKSINMPYFK,ph,S,107,true,"Phosphoproteome ethylene-regulated time response",46,24043427,"MASCOT Score",41.7400000,,,,,,-1.5446000
VKSINMPYFK,ph,S,107,true,"atm and atr DNA damage response",88,25561503,"MASCOT Score",48.0000000,1.0000000,,,,,1.5500000
VKSINMPYFK,ph,S,107,true,"Phospho cell culture sucrose/TOR",109,30833711,,,1.0000000,,,,,
VKSINMPYFK,ph,S,107,true,"Tissue atlas Arabidopsis - ProteomicsDB",114,32188942,"MaxQuant score",211.2200000,1.0000000,,,,8.4884802708749E-20,
VKSINMPYFK,ph,S,107,true,"Touch-induced phosphorylation: 40s touch vs untouc",136,30291188,"MASCOT score",50.0900000,,2.0086198,0.0720425,NO,,9.3286607
SINMPYFK,ph,S,107,true,"srk2dei ABA signaling phopshoproteomics",83,23572148,"MASCOT Score",37.0000000,,,,,,0.0003000
SINMPYFK,ph,S,107,true,"atm and atr DNA damage response",88,25561503,"MASCOT Score",42.0000000,1.0000000,,,,,-2.5200000
FGAPSLLQR,ph,S,160,true,"Chloroplast kinase substrates",60,19376835,"MASCOT Score",45.8000000,,,,,,-2.5715800
FGAPSLLQR,ph,S,160,true,"atm and atr DNA damage response",88,25561503,"MASCOT Score",39.0000000,1.0000000,,,,,0.4200000
FGAPSLLQR,ph,S,160,true,"TOR Kinase and ABA Receptor",100,29290610,XCorr,2.7664459,1.0000000,,,,0.011260000057518,
FGAPSLLQR,ph,S,160,true,"Tissue atlas Arabidopsis - ProteomicsDB",114,32188942,"MaxQuant score",132.8500000,1.0000000,,,,0.00011040500248782,
VKSIKLPSLYR,ph,S,167,true,"STN8 phosphoproteome",38,21768351,"MASCOT Score",66.2800000,,,,,,0.7433200
VKSIKLPSLYR,ph,S,167,true,"Phosphoproteome ethylene-regulated time response",46,24043427,"MASCOT Score",63.7300000,,,,,,-18.4460000
VKSIKLPSLYR,ph,S,167,true,"Chloroplast kinase substrates",60,19376835,"MASCOT Score",52.3700000,,,,,,-0.0576664
VKSIKLPSLYR,ph,S,167,true,"Tissue atlas Arabidopsis - ProteomicsDB",114,32188942,"MaxQuant score",125.3000000,1.0000000,,,,5.6339899856539E-6,
SASERHIGREEEETVEAVEK,ph,T,225,true,"srk2dei ABA signaling phopshoproteomics",83,23572148,"MASCOT Score",34.0000000,,,,,,0.0009000
EEEETVEAVEKR,ub,K,231,true,"Arabidopsis ubiquitination COFRADIC",40,26744219,"MaxQuant Score",61.1100000,1.0000000,,,,0.003000000026077,0.0180000
RPETMRVER,ph,T,236,true,"Tissue atlas Arabidopsis - ProteomicsDB",114,32188942,"MaxQuant score",93.0110000,1.0000000,,,,0.0011223800247535,
TTSIGDGGEEGVDDK,ph,T,242,true,"Large-scale phosphorylation discovery",44,23111157,XCorr,4.0300000,,,,,,
TTSIGDGGEEGVDDK,ph,T,242,true,"Lateral root-induction - NAA vs control",106,23328941,"MASCOT Score",50.0000000,,,,,,
TTSIGDGGEEGVDDKASNFINKFK,ph,S,244,true,"MAPK Arabidopsis substrates",45,23172892,"MaxQuant Score",129.1100000,,,,,,
TTSIGDGGEEGVDDKASNFINK,ph,S,244,true,"Chloroplast kinase substrates",60,19376835,"MASCOT Score",44.3900000,,,,,,-0.7533790
TTSIGDGGEEGVDDK,ph,S,244,true,"Tyrosine phosphorylation in Arabidopsis",59,18463617,"MASCOT Score",75.0000000,,,,,,-0.9624009
TTSIGDGGEEGVDDK,ph,S,244,true,"Conserved plant phosphoproteome - Arabidopsis",61a,20466843,"MASCOT Score",93.0000000,1.0000000,,,,,
TTSIGDGGEEGVDDK,ph,S,244,true,"srk2dei ABA signaling phopshoproteomics",83,23572148,"MASCOT Score",106.0000000,,,,,,-0.0008000
TTSIGDGGEEGVDDK,ph,S,244,true,"LAXIC - ABA stress",84a,23660473,XCorr,3.8900000,0.9330000,,,,1.7800000478019E-6,
TTSIGDGGEEGVDDK,ph,S,244,true,"LAXIC - mannitol vs control",84b,23660473,XCorr,4.2000000,0.9880000,,,,0.0010334199760109,
TTSIGDGGEEGVDDK,ph,S,244,true,"SnRK2 protein kinase substrates",85,23776212,XCorr,4.0120878,0.9910000,,,,0.0032809299882501,
TTSIGDGGEEGVDDK,ph,S,244,true,"atm and atr DNA damage response",88,25561503,"MASCOT Score",78.0000000,0.9970000,,,,,0.0800000
TTSIGDGGEEGVDDK,ph,S,244,true,"Protein sumoylation and phosphorylation cross-talk",97,28419593,,,,,,,,
TTSIGDGGEEGVDDK,ph,S,244,true,"TOR Kinase and ABA Receptor",100,29290610,XCorr,4.3621721,0.8759000,,,,5.534000138141E-7,
TTSIGDGGEEGVDDK,ph,S,244,true,"Lateral root-induction - NAA vs control",106,23328941,"MASCOT Score",52.0000000,,,,,,
TTSIGDGGEEGVDDK,ph,S,244,true,"Tissue atlas Arabidopsis - ProteomicsDB",114,32188942,"MaxQuant score",277.6400000,0.9999980,,,,0,
LQRLDSFLR,ph,S,275,true,"STN8 phosphoproteome",38,21768351,"MASCOT Score",56.3800000,,,,,,-0.3698280
LQRLDSFLR,ph,S,275,true,"MAPK Arabidopsis substrates",45,23172892,"MaxQuant Score",129.8500000,,,,,,
LQRLDSFLR,ph,S,275,true,"Chloroplast kinase substrates",60,19376835,"MASCOT Score",56.8700000,,,,,,-0.3698280
LQRLDSFLR,ph,S,275,true,"Tissue atlas Arabidopsis - ProteomicsDB",114,32188942,"MaxQuant score",110.1500000,1.0000000,,,,0.00013606599532068,
LDSFLR,ph,S,275,false,"TOR Kinase and ABA Receptor",100,29290610,XCorr,2.5711641,1.0000000,,,,0.027049999684095,
LDSFLR,ph,S,275,false,"Lateral root-induction - NAA vs control",106,23328941,"MASCOT Score",22.0000000,,,,,,
LDSFLR,ph,S,275,false,"Touch-induced phosphorylation: 40s touch vs untouc",136,30291188,"MASCOT score",46.1500000,,1.9054886,0.0005951,YES,,8.8989558
